program: Gaussian 09
title: 000144803
version: EM64L-G09RevD.01
frameworkgroup: C1[X(C13H10N2O2)]
method: RPBEPBE
basis: SDD
operation: Freq
keyword: #p
keyword: freq=noraman
keyword: PBEPBE/SDD
title: #p freq=noraman PBEPBE/SDD
converged: YES YES NO NO
title: Mulliken charges:
elementType: O O N N C C C C C C C C C C C C C H H H H H H H H H H
charge: -0.170615 -0.175208 -0.042841 -0.067399 0.344347 0.314406 -0.370887 -0.371003 -0.353763 0.183612 -0.232382 -0.228246 -0.235281 -0.297322 -0.188085 -0.177457 -0.369859 0.266576 0.238351 0.249655 0.233512 0.233809 0.254887 0.236034 0.244161 0.235725 0.245271
chargesum: 0.00000
title: Mulliken charges with hydrogens summed into heavy atoms:
elementType: O O N N C C C C C C C C C C C C C
charge: -0.170615 -0.175208 -0.042841 -0.067399 0.344347 0.314406 -0.104311 -0.132652 -0.104108 0.183612 0.001131 0.005563 0.000754 -0.042435 0.056076 0.058267 -0.124588
polarizability: 3.14150234e+02 3.60980621e+00 1.54319753e+02 -1.27042754e+00 -2.53507770e+00 8.41711850e+01
1716.lowfreq: -5.0704 0.0008 0.0009 0.0010 1.6229 5.3247 24.9220 32.0214 44.7153
frequency: 24.7116 31.9290 44.6973 55.3989 81.7814 139.4362 149.2395 198.4360 249.0292 279.3199 307.9910 325.6545 399.1388 404.2997 462.8627 518.6303 526.7551 568.0315 613.4748 621.7088 643.2430 669.7967 692.3260 707.5492 738.4899 771.6024 780.2045 793.3187 836.1539 846.7202 894.3768 903.2200 924.9208 946.6276 956.0692 961.2319 977.9160 987.8280 999.6320 1000.9308 1031.9780 1043.2694 1094.6354 1095.2946 1177.2645 1178.3403 1202.9036 1207.9704 1231.1273 1268.4072 1283.9220 1311.9143 1333.3168 1336.1482 1374.5462 1381.0872 1413.9699 1438.4080 1450.9429 1486.0651 1560.9820 1574.3525 1582.0433 1608.7755 1638.6540 3130.8097 3132.4341 3138.1183 3140.6561 3147.7711 3150.4614 3158.8707 3170.5110 3172.2218 3189.9361
redmass: 8.0964 3.9873 6.6638 5.1909 5.7673 7.4324 6.1882 5.4183 5.7191 6.6772 4.4867 5.8419 2.8015 3.4981 3.5688 2.9479 7.7936 7.8527 6.6499 7.1427 6.5147 4.8447 1.8884 7.1767 1.9104 1.7806 2.4349 4.8283 3.9405 1.3578 1.2914 1.4779 1.4789 4.6804 6.8357 1.4705 1.4329 5.3570 1.3299 1.3542 2.1493 2.4532 1.6260 1.7209 1.1373 1.0923 1.5371 1.4929 5.1591 3.6341 2.2424 2.0828 1.4169 2.2431 11.7667 6.2028 1.8897 2.3179 2.2528 2.2235 4.9705 5.3663 5.6101 5.8504 8.7276 1.0888 1.0851 1.0882 1.0877 1.0902 1.0922 1.0965 1.0979 1.1017 1.0966
irintensity: 1.2430 0.3164 1.8878 0.7122 1.7388 3.1652 1.4776 0.5697 0.6928 0.3788 0.2325 0.8245 0.1402 4.0385 1.0262 16.7098 20.6150 18.0627 0.2131 1.0122 14.4080 1.7161 38.3377 8.1845 30.2324 24.6973 50.6821 18.5608 1.0198 0.0601 3.8105 16.6347 0.9686 1.2427 3.5524 0.9645 0.4337 1.1481 0.0050 0.2545 4.9606 3.5439 8.8763 5.1602 1.5597 0.9434 0.3364 5.6244 40.9875 25.3755 5.7023 2.0184 5.8352 4.3961 160.9240 0.6040 9.7694 15.1099 46.4769 22.6531 14.2007 41.3463 3.9439 0.0203 21.1143 21.5261 3.0725 5.8105 13.2417 10.2033 7.1262 22.7554 30.8443 23.3565 5.2155
temp: 298.150 k
press: 1.00000 atm
elementType: 8 8 7 7 6 6 6 6 6 6 6 6 6 6 6 6 6 1 1 1 1 1 1 1 1 1 1
symmnumber: 1
zpe: 525596.0 jmol-1
zpe.correction: 0.200189 hartree
zpe.thermalcorrener: 0.214316 hartree
zpe.thermalcorrenthalpy: 0.215261 hartree
zpe.thermalcorrgfe: 0.156406 hartree
zpe.sumelectzpe: -760.045132 hartree
zpe.sumelectthermal: -760.031004 hartree
zpe.sumelectthermalent: -760.030060 hartree
zpe.sumelectthermalfe: -760.088915 hartree
dipole: -0.1837 -1.6853 0.3776
dipole: 1.7368
quadrupole: -65.5636 -99.7471 -106.1374
quadrupole: -4.4048 -1.9083 -2.3204
quadrupole: 24.9191 -9.2644 -15.6547 -4.4048 -1.9083 -2.3204
hfenergy: -760.2453206 hartree
pointgroup: C01 [X(C13H10N2O2)]
dipole: -0.0463508 0.6203764 0.2826355 debye
polarizability: 313.6007678|-10.2166588|131.6904184|-1.8051976|33.2022705|107.3499855 unknown
InChI: InChI=1S/C13H10N2O2/c16-15(17)13(11-6-2-1-3-7-11)10-12-8-4-5-9-14-12/h1-10H
charge 0 multiplicity 1
27 atoms
O  0.023202 -2.407304 -0.63461
O  0.128025 -0.984669 -2.415583
N  0.193124 -1.240605 -1.154104
N  -2.623013 1.267809 1.167982
C  1.966194 0.105024 -0.031133
C  0.515425 -0.10871 -0.228015
C  -0.500606 0.599733 0.350941
C  2.449326 1.367118 0.419586
C  2.905333 -0.9339 -0.286471
C  -1.962551 0.510441 0.216962
C  3.826637 1.57313 0.629281
C  4.283737 -0.719108 -0.0825
C  4.752029 0.531571 0.380285
C  -2.677961 -0.235911 -0.764563
C  -4.087947 -0.224076 -0.74078
C  -4.761795 0.5302 0.246072
C  -3.981724 1.264134 1.171285
H  -0.206392 1.359649 1.084387
H  1.751251 2.195285 0.579955
H  2.561382 -1.91747 -0.624191
H  4.180536 2.551071 0.973008
H  4.991831 -1.53076 -0.280515
H  -2.161929 -0.79488 -1.547592
H  5.823397 0.696473 0.536875
H  -4.651105 -0.792381 -1.488255
H  -5.854528 0.560682 0.294638
H  -4.457179 1.878352 1.944655
