program: Gaussian 09
title: 000144802
version: EM64L-G09RevD.01
frameworkgroup: C1[X(C14H13N)]
method: RPBEPBE
basis: SDD
operation: Freq
keyword: #pfreq=noraman
keyword: PBEPBE/SDD
title: #p freq=noraman PBEPBE/SDD
converged: YES YES NO NO
title: Mulliken charges:
elementType: N C C C C C C C C C C C C C C H H H H H H H H H H H H H
charge: -0.066489 0.338659 0.297365 -0.378240 -0.291423 -0.415641 -0.832936 -0.258328 -0.233751 -0.313102 0.185132 -0.320338 -0.198781 -0.183658 -0.374433 0.284849 0.220952 0.229256 0.239259 0.227490 0.239198 0.226119 0.227270 0.215494 0.230486 0.236913 0.230377 0.238303
chargesum: 0.00000
title: Mulliken charges with hydrogens summed into heavy atoms:
elementType: N C C C C C C C C C C C C C C
charge: -0.066489 0.338659 0.297365 -0.157288 -0.006574 -0.186384 -0.126990 -0.032210 -0.006481 -0.097609 0.185132 -0.089852 0.038131 0.046719 -0.136130
polarizability: 3.32395026e+02 1.54448453e+00 1.61935783e+02 1.65110848e-02 -2.13275867e-02 6.55122815e+01
1716.lowfreq: -0.0007 -0.0006 -0.0002 4.5830 5.3386 15.5677 25.0948 58.3513 71.0034
frequency: 24.6136 58.3333 70.9723 105.1901 177.9827 187.1032 197.7179 227.8797 242.0963 300.5327 392.3804 404.0434 445.1974 477.0368 496.8504 521.8874 545.4295 577.1115 614.7722 647.1866 722.5743 742.2598 759.7295 766.2710 789.3829 834.8005 868.1221 870.0144 877.8738 903.4933 949.4382 956.5929 961.8853 986.5271 988.1068 994.6245 1010.9462 1037.8277 1043.4245 1049.5342 1089.5686 1101.5031 1164.3984 1174.8138 1191.5515 1210.1394 1235.3448 1289.9001 1297.6532 1311.5073 1316.8057 1332.5307 1377.9986 1400.8995 1411.7482 1437.3471 1452.7128 1474.9844 1476.9427 1487.1143 1551.1045 1573.3213 1577.5035 1608.8030 1640.3458 2979.2222 3056.8274 3086.2805 3107.9148 3119.2753 3120.2435 3128.7740 3130.8358 3136.4047 3143.2452 3148.9913 3161.5948 3170.2841
redmass: 3.7146 4.6980 4.3876 3.7253 1.1366 2.4336 5.8321 2.5494 4.3065 3.3034 3.1623 3.3569 2.6643 4.4531 2.8827 5.0128 3.2378 6.7762 6.9965 6.0310 2.2852 1.6692 1.3770 4.8867 2.3355 4.5963 4.0797 1.3290 1.5406 1.6166 1.3880 1.4639 6.7819 1.3367 1.6064 1.3380 1.1524 2.3932 1.5699 2.1728 1.6223 2.0750 1.0769 1.0911 1.8513 1.6308 2.0586 3.7460 1.6352 1.6216 1.5245 2.7293 4.2301 1.2753 1.9897 2.1608 2.3413 1.0457 1.9426 1.3648 5.2417 5.8374 5.8863 5.8886 5.5648 1.0375 1.0974 1.0987 1.0912 1.0859 1.0888 1.0879 1.0886 1.0871 1.0937 1.0942 1.1008 1.1010
irintensity: 1.0449 1.3854 0.5650 1.4492 0.1879 1.9676 0.4601 0.0010 0.5420 1.3580 2.4000 3.2643 5.2497 3.2502 6.8538 9.3354 7.3773 14.3476 0.2573 0.8289 16.7221 49.4428 18.7772 0.1584 66.8591 0.3253 0.7964 0.3285 4.9732 8.5410 0.0254 3.1811 3.5506 0.8417 1.3322 0.6166 43.9353 3.5086 6.7185 6.9808 4.0366 1.4885 6.7218 2.7550 4.7735 5.3250 12.9559 2.0558 9.9241 2.7883 16.9663 0.0597 7.8345 10.7717 30.5523 3.3749 68.0128 13.0021 34.9459 33.2089 16.2958 54.1685 97.4243 2.6744 37.6348 22.6407 17.0673 24.1065 14.1678 12.7192 29.3991 3.6102 3.3421 8.3640 29.9727 27.9984 43.9843 29.9088
temp: 298.150 k
press: 1.00000 atm
elementType: 7 6 6 6 6 6 6 6 6 6 6 6 6 6 6 1 1 1 1 1 1 1 1 1 1 1 1 1
symmnumber: 1
zpe: 595167.2 jmol-1
zpe.correction: 0.226687 hartree
zpe.thermalcorrener: 0.239537 hartree
zpe.thermalcorrenthalpy: 0.240481 hartree
zpe.thermalcorrgfe: 0.186102 hartree
zpe.sumelectzpe: -594.986574 hartree
zpe.sumelectthermal: -594.973724 hartree
zpe.sumelectthermalent: -594.972780 hartree
zpe.sumelectthermalfe: -595.027160 hartree
dipole: 0.9435 -1.0157 0.0026
dipole: 1.3863
quadrupole: -68.5028 -77.5437 -95.3586
quadrupole: -3.2465 0.0077 0.0007
quadrupole: 11.9656 2.9247 -14.8902 -3.2465 0.0077 0.0007
hfenergy: -595.2132615 hartree
pointgroup: C01 [X(C14H13N1)]
dipole: 0.3691008 -0.4015524 0.0008663 debye
polarizability: 332.404577|0.6465789|161.9235957|0.7280115|0.2534131|65.5149184 unknown
InChI: InChI=1S/C14H13N/c1-12-6-2-3-7-13(12)9-10-14-8-4-5-11-15-14/h2-11H,1H3
charge 0 multiplicity 1
28 atoms
N  2.455041 0.995116 -0.043101
C  -1.759134 -0.082733 -0.055144
C  -2.694037 1.009535 -0.054103
C  -2.267979 -1.415876 -0.061102
C  -0.314837 0.193191 -0.050153
C  -4.081652 0.724213 -0.059152
C  -2.232983 2.45877 -0.04781
C  -3.649455 -1.679492 -0.066053
C  -4.566929 -0.602059 -0.06511
C  0.706352 -0.721344 -0.050927
C  2.127787 -0.346668 -0.045959
C  3.136423 -1.353997 -0.044214
C  4.495936 -0.981281 -0.039717
C  4.828853 0.393078 -0.036954
C  3.770037 1.334991 -0.038716
H  0.002169 1.242899 -0.045486
H  -1.568064 -2.258594 -0.061952
H  -4.793401 1.558544 -0.058367
H  -1.617489 2.698987 -0.93484
H  -3.099415 3.141343 -0.046769
H  -1.620438 2.692338 0.842979
H  -4.011995 -2.713432 -0.070562
H  -5.645922 -0.79278 -0.068871
H  0.504451 -1.80054 -0.055447
H  2.84593 -2.410549 -0.046418
H  5.280466 -1.7456 -0.038427
H  5.869923 0.730184 -0.03359
H  3.983464 2.410955 -0.036636
