program: Gaussian 09
title: 000144800
version: EM64L-G09RevD.01
frameworkgroup: C1[X(C5H7N3)]
method: RPBEPBE
basis: SDD
operation: Freq
keyword: #p
keyword: freq=noraman
keyword: PBEPBE/SDD
title: #p freq=noraman PBEPBE/SDD
converged: NO YES NO NO
title: Mulliken charges:
elementType: N N N C C C C C H H H H H H H
charge: -0.108772 -0.108770 -0.084937 0.226339 0.226352 -0.371133 -0.756743 -0.756743 0.250481 0.237024 0.268055 0.236882 0.268057 0.237015 0.236892
chargesum: 0.00000
title: Mulliken charges with hydrogens summed into heavy atoms:
elementType: N N N C C C C C
charge: -0.108772 -0.108770 -0.084937 0.226339 0.226352 -0.120651 -0.014782 -0.014780
polarizability: 9.49921251e+01 6.75529118e-05 7.79689206e+01 -2.09151300e-03 7.91687243e-03 4.19341364e+01
1716.lowfreq: -7.9497 -0.0006 -0.0006 -0.0002 8.8274 10.4353 54.8923 58.1142 143.2557
frequency: 54.7241 57.7518 143.2494 187.7405 269.6297 379.5875 385.4519 519.7750 531.0489 535.3059 761.5017 763.9689 848.0036 909.8624 918.2070 921.7822 985.1249 1020.4218 1045.8521 1053.4791 1113.4538 1139.3002 1299.2634 1348.3518 1394.2125 1394.5072 1418.9353 1457.6227 1467.2660 1467.6532 1485.5661 1564.1028 2987.6266 2987.9607 3068.8215 3068.9316 3119.5297 3119.7750 3139.0563
redmass: 1.0278 1.0599 2.9667 5.6750 2.5399 2.8579 3.7293 3.4999 5.0248 6.2010 7.4739 5.0100 8.4271 1.2768 4.0595 4.4442 1.9248 1.6137 1.5421 1.6343 6.2692 2.1802 2.1858 4.7942 1.2243 1.3339 2.2812 1.0533 1.0464 1.0449 1.5833 6.0040 1.0379 1.0379 1.0974 1.0974 1.0988 1.0987 1.0938
irintensity: 0.0000 0.0915 0.0188 0.0000 3.2888 0.0448 0.3783 0.0001 0.8465 4.0401 0.0719 0.3568 27.5277 4.7924 3.3682 0.4192 8.8860 2.1679 0.0004 21.0563 2.6755 4.7665 8.8695 18.8227 38.0035 34.5145 6.2082 9.4140 37.1410 0.0019 4.8834 137.6588 8.9099 9.1870 0.0161 25.6623 7.8298 3.3732 8.8603
temp: 298.150 k
press: 1.00000 atm
elementType: 7 7 7 6 6 6 6 6 1 1 1 1 1 1 1
symmnumber: 1
zpe: 301066.6 jmol-1
zpe.correction: 0.114670 hartree
zpe.thermalcorrener: 0.122751 hartree
zpe.thermalcorrenthalpy: 0.123695 hartree
zpe.thermalcorrgfe: 0.081263 hartree
zpe.sumelectzpe: -358.327646 hartree
zpe.sumelectthermal: -358.319565 hartree
zpe.sumelectthermalent: -358.318621 hartree
zpe.sumelectthermalfe: -358.361053 hartree
dipole: -0.0001 6.1469 0.0021
dipole: 6.1469
quadrupole: -43.5212 -53.8309 -46.9289
quadrupole: 0.0001 0.0001 -0.0001
quadrupole: 4.5725 -5.7372 1.1648 0.0001 0.0001 -0.0001
hfenergy: -358.4423166 hartree
pointgroup: C01 [X(C5H7N3)]
dipole: -0.0001486 2.4183863 -0.0008128 debye
dipolederiv: -0.4776014 0.0441293 0.0000419 0.3734755 -0.3102222 0.0001319 -0.0000433 0.0000361 -0.1311382 -0.4775718 -0.0440778 -0.0000082 -0.3734712 -0.3101744 0.0001648 0.0000758 0.0000407 -0.1311455 0.3277118 -0.0000685 -0.0000318 -0.0000141 0.1793021 -0.0001437 -0.0000296 -0.000029 -0.2345936 0.6469321 -0.2285625 0.0002048 -0.2770589 0.1772692 -0.0001771 0.0005738 -0.0001609 0.1218902 0.6468797 0.2286597 -0.0002205 0.2771282 0.1772601 -0.0001837 -0.0005605 -0.0001562 0.1218997 -0.6227029 -0.0000827 0.0000201 -0.0000624 0.0786172 -0.0001082 0.0000113 -0.0001089 -0.0796021 -0.2020177 0.1155142 -0.0001365 0.2433993 -0.0807715 0.0002644 -0.0009961 0.0005934 0.0269327 -0.2019707 -0.1155246 0.0001441 -0.2434158 -0.0808191 0.0002571 0.0009022 0.0005298 0.0269347 0.1249608 0.0000219 0.000002 0.0000156 -0.0866354 0.0000355 0.000002 -0.0000137 0.123379 0.0513863 0.0127096 0.0155458 0.0281105 0.0497773 0.1071594 -0.0332451 0.1095691 -0.0238674 0.0149529 -0.040505 0.0003008 -0.1373851 0.0297033 0.0004165 0.0005795 0.000169 0.1244866 0.0513557 0.0122484 -0.0159259 0.0279567 0.0485963 -0.1076998 0.0332421 -0.1101261 -0.0228992 0.0149373 0.0404998 -0.0002532 0.1373844 0.0297281 0.0003524 -0.0004984 0.0001448 0.1244867 0.0513886 -0.0126716 -0.0155893 -0.0280877 0.0497048 0.107192 0.0332257 0.1096084 -0.0238119 0.0513594 -0.0122903 0.015906 -0.0279749 0.0486642 -0.1076614 -0.0332396 -0.1100965 -0.0229518 unknown
polarizability: 94.992125|0.0011516|77.9689207|-0.0020909|-0.007917|41.9341364 unknown
InChI: InChI=1S/C5H7N3/c1-4-3-5(2)7-8-6-4/h3H,1-2H3
charge 0 multiplicity 1
15 atoms
N  -1.20014 -1.03508 0.000072
N  1.200242 -1.034903 -0.000065
N  0.000125 -1.713112 0.000094
C  -1.210747 0.350073 -0.000108
C  1.210657 0.350279 -0.000237
C  -0.000099 1.07807 -0.000216
C  -2.570572 1.001219 -0.00033
C  2.570403 1.001584 -0.000569
H  -0.000198 2.173446 -0.000347
H  -2.705425 1.640017 -0.892687
H  -3.350022 0.223804 0.002321
H  -2.703599 1.644682 0.888905
H  3.349939 0.224257 0.001686
H  2.704975 1.640675 -0.892757
H  2.70356 1.644789 0.888836
