program: Gaussian 09
title: 000144797
version: EM64L-G09RevD.01
frameworkgroup: C1[X(C14H14N2O)]
method: RPBEPBE
basis: SDD
operation: Freq
keyword: #p
keyword: freq=noraman
keyword: PBEPBE/SDD
title: #p freq=noraman PBEPBE/SDD
converged: YES YES NO NO
title: Mulliken charges:
elementType: O N N C C C C C C C C C C C C C C H H H H H H H H H H H H H H
charge: -0.261812 -0.110897 -0.134139 0.493366 0.050468 -0.492248 0.210906 -0.339800 -0.338439 -0.808039 0.184294 -0.347985 -0.297161 -0.204198 -0.203652 -0.239435 -0.501006 0.281333 0.234384 0.253813 0.230973 0.228066 0.229401 0.249927 0.256982 0.230059 0.226308 0.230056 0.234345 0.234329 0.219805
chargesum: 0.00000
title: Mulliken charges with hydrogens summed into heavy atoms:
elementType: O N N C C C C C C C C C C C C C C
charge: -0.261812 -0.110897 -0.134139 0.493366 0.050468 -0.210915 0.210906 -0.105416 -0.084626 -0.119600 0.184294 -0.098058 -0.040180 0.025861 0.022656 -0.009379 0.187472
polarizability: 3.60448925e+02 7.93148568e+00 1.93520449e+02 2.70505505e-02 -8.00665603e-02 7.39830095e+01
1716.lowfreq: -9.7520 -2.4546 -0.0010 -0.0005 0.0002 0.7284 17.7036 47.8682 65.1530
frequency: 17.6302 47.7384 65.1428 65.2953 77.3197 131.2307 147.7831 182.2653 210.0574 215.4925 266.8287 274.6781 284.5873 339.0494 342.4252 407.6830 415.6198 471.2507 474.7601 519.4956 525.1668 575.5420 579.4760 611.0402 646.7599 691.6870 707.2983 734.5160 754.1137 782.0413 825.5955 848.1851 869.1147 918.1681 935.0039 945.4334 968.8135 975.1280 982.7683 984.9018 996.9309 1013.2513 1015.0492 1049.7969 1073.6286 1103.6630 1113.9472 1141.6228 1153.1472 1157.2865 1169.8130 1197.3300 1221.8334 1244.2569 1263.6909 1301.9331 1344.5800 1384.9203 1391.4996 1397.5413 1400.4168 1439.1942 1442.5854 1446.5912 1451.3400 1464.8523 1470.8394 1474.8805 1485.2337 1562.0518 1581.6876 1601.8887 1622.4370 2974.6768 2990.1911 3051.0296 3087.5100 3096.1438 3117.9785 3126.6674 3127.0623 3137.8529 3152.4912 3152.6972 3166.2734 3169.4465 3174.4336
redmass: 3.8003 3.3170 3.1989 4.4530 1.1480 4.5382 3.9726 4.5966 4.3531 2.1252 1.6313 3.7084 4.9728 3.0968 4.2006 2.8950 5.1951 6.6187 3.2790 3.0498 6.5595 3.6698 5.2285 6.4735 7.1764 1.8575 5.1853 3.4096 6.3907 1.8437 1.4094 1.2486 6.3543 1.3690 1.4541 2.5893 1.3388 7.5299 1.3752 6.0494 1.3209 1.8051 1.9136 1.5351 1.5187 2.3595 1.2460 1.6488 1.3341 1.3360 1.0611 1.9189 3.7467 3.3926 1.7447 1.4328 6.8109 4.5378 4.3335 1.7421 2.4861 1.4348 2.2200 1.0537 1.0756 2.0721 1.0460 1.1572 2.5266 6.5813 6.2079 6.2887 6.3557 1.0375 1.0282 1.0976 1.0985 1.1041 1.1055 1.0853 1.0894 1.0887 1.0932 1.0910 1.0971 1.0952 1.0973
irintensity: 0.3041 1.9124 5.9220 1.4077 0.2355 1.9392 0.5244 0.0159 3.2562 0.3681 0.1521 1.7343 0.0230 2.4304 3.6482 0.0007 3.1600 3.7063 0.0056 20.2383 29.9387 0.5745 3.4870 0.0515 1.9549 44.0038 17.1937 12.8048 1.1890 51.8408 47.3089 0.2073 0.0919 2.7076 6.3463 1.5200 3.0820 31.5310 0.0472 0.7050 0.3755 1.4043 18.8847 12.1944 8.3467 16.4789 0.1161 18.2828 14.0240 52.1996 0.0701 0.8241 157.2070 37.2303 49.5767 3.8268 51.6505 7.6991 4.4544 0.2222 20.5976 17.3581 3.8996 12.8746 46.2891 11.1466 13.0022 10.1967 108.7765 60.8536 3.7105 0.6035 2.3962 46.9193 43.9986 22.3181 12.8058 30.9653 47.7620 4.0328 15.4465 9.5645 20.0546 10.6260 30.4999 15.4964 19.8526
temp: 298.150 k
press: 1.00000 atm
elementType: 8 7 7 6 6 6 6 6 6 6 6 6 6 6 6 6 6 1 1 1 1 1 1 1 1 1 1 1 1 1 1
symmnumber: 1
zpe: 643120.0 jmol-1
zpe.correction: 0.244951 hartree
zpe.thermalcorrener: 0.260613 hartree
zpe.thermalcorrenthalpy: 0.261557 hartree
zpe.thermalcorrgfe: 0.200259 hartree
zpe.sumelectzpe: -725.351443 hartree
zpe.sumelectthermal: -725.335782 hartree
zpe.sumelectthermalent: -725.334838 hartree
zpe.sumelectthermalfe: -725.396135 hartree
dipole: -0.5374 0.0541 0.0003
dipole: 0.5401
quadrupole: -80.8659 -88.4076 -105.1477
quadrupole: -5.5701 0.0099 -0.0332
quadrupole: 10.6079 3.0661 -13.6740 -5.5701 0.0099 -0.0332
hfenergy: -725.5963944 hartree
pointgroup: C01 [X(C14H14N2O1)]
dipole: 0.2115767 0.0181848 0.0075358 debye
polarizability: 359.8979223|-10.5198441|193.5968908|8.993465|4.4502245|74.4575703 unknown
InChI: InChI=1S/C14H14N2O/c1-11-8-9-14(17-2)13(10-11)16-15-12-6-4-3-5-7-12/h3-10H,1-2H3
charge 0 multiplicity 1
31 atoms
O  -1.981568 2.670119 0.165278
N  -0.038534 0.396862 0.141537
N  0.692502 -0.693892 0.121899
C  -3.410764 -1.332671 -0.035603
C  -1.443206 0.179808 0.086692
C  -2.026795 -1.127203 0.017827
C  -2.31424 1.321198 0.101948
C  -4.257328 -0.179904 -0.019213
C  -3.722031 1.110781 0.047573
C  -4.011114 -2.725189 -0.110829
C  2.104677 -0.462039 0.177991
C  2.907358 -1.634202 0.155849
C  2.728459 0.817428 0.251442
C  4.313353 -1.535079 0.206075
C  4.13201 0.908201 0.301114
C  4.930696 -0.264055 0.278657
C  -0.599539 3.167483 0.232664
H  -1.329543 -1.971115 0.008807
H  -5.345925 -0.308635 -0.059086
H  -4.363766 1.99676 0.060914
H  -3.229436 -3.502862 -0.080987
H  -4.704845 -2.910687 0.73096
H  -4.58911 -2.864022 -1.044387
H  2.402158 -2.604137 0.099058
H  2.099741 1.71237 0.268348
H  4.926193 -2.44289 0.188692
H  4.613015 1.891492 0.357653
H  6.022792 -0.184172 0.317454
H  -0.024516 2.861417 -0.657548
H  -0.085758 2.788149 1.131983
H  -0.714935 4.262388 0.273241
