program: Gaussian 09
title: 000144787
version: EM64L-G09RevD.01
frameworkgroup: C1[X(C38H16)]
method: RPBEPBE
basis: SDD
operation: Freq
keyword: #p
keyword: freq=noraman
keyword: PBEPBE/SDD
title: #p freq=noraman PBEPBE/SDD
converged: YES YES NO YES
title: Mulliken charges:
elementType: C C C C C C C C C C C C C C C C C C C C C C C C C C C C C C C C C C C C C C H H H H H H H H H H H H H H H H
charge: -1.008700 -0.703469 0.268783 0.159668 -0.727765 0.591733 0.279658 0.478526 0.573359 -0.114158 0.273424 0.338084 0.255534 0.087248 0.421908 0.552116 -0.090192 -0.757978 0.435267 0.455701 0.397808 -0.441122 -0.440950 0.471139 -0.507510 -0.445605 0.449592 -0.527670 -0.482244 -0.476501 -0.448492 -0.481915 -0.462728 -0.491477 -0.476807 -0.480420 -0.478721 -0.280245 0.262891 0.234367 0.248314 0.227355 0.226600 0.242563 0.240235 0.241334 0.250282 0.239063 0.232327 0.237908 0.241164 0.235997 0.244503 0.230217
chargesum: 0.00000
title: Mulliken charges with hydrogens summed into heavy atoms:
elementType: C C C C C C C C C C C C C C C C C C C C C C C C C C C C C C C C C C C C C C
charge: -1.008700 -0.703469 0.268783 0.159668 -0.727765 0.591733 0.279658 0.478526 0.573359 -0.114158 0.273424 0.338084 0.255534 0.087248 0.421908 0.552116 -0.090192 -0.495087 0.435267 0.455701 0.397808 -0.206756 -0.192637 0.471139 -0.280154 -0.219005 0.449592 -0.285106 -0.242009 -0.235167 -0.198210 -0.242852 -0.230401 -0.253568 -0.235643 -0.244422 -0.234218 -0.050028
polarizability: 8.63257711e+02 -8.18116182e+00 5.68609508e+02 7.84190720e-01 2.19761765e+00 1.46793220e+02
1716.lowfreq: -4.1365 -0.0011 -0.0007 -0.0004 2.7442 7.1648 28.3919 48.8595 82.5939
frequency: 28.3904 48.8501 82.5932 102.0890 121.5998 136.0501 142.7199 187.9634 206.3052 231.1986 242.0517 258.8155 270.5333 274.4850 287.8190 310.8095 335.4959 369.0914 378.7801 388.5096 395.2676 398.7482 418.7946 424.8725 433.5510 438.2082 463.0644 472.3132 493.0418 495.6603 504.4245 510.4781 527.7723 529.2314 547.1031 554.4886 561.2048 582.0253 600.2408 611.0042 617.1813 621.3091 632.6274 647.9830 651.4332 660.6130 678.0381 692.5680 705.1381 727.1091 744.7708 745.6185 753.7003 762.0389 777.1934 778.8461 789.8275 799.0958 803.8692 812.2015 827.7504 830.3915 831.8666 838.7152 853.1489 860.0350 866.3376 873.1572 882.9174 914.3261 924.7175 935.5805 946.8193 957.6798 964.1417 968.4974 972.9830 974.4947 977.1062 982.8593 984.6311 988.7136 991.5919 1025.3449 1065.4368 1087.9603 1111.2289 1115.1663 1129.8362 1149.3000 1153.5273 1156.7032 1163.7305 1171.3069 1201.7540 1204.7990 1214.1885 1217.2272 1224.7884 1230.9161 1236.9442 1245.8290 1252.6393 1275.5991 1284.4256 1306.9161 1319.0147 1343.8680 1348.2524 1370.6914 1385.2442 1388.3780 1394.4590 1399.0156 1406.4221 1415.4611 1419.7711 1425.9310 1434.0470 1438.3712 1439.4659 1450.6257 1457.5092 1475.5036 1481.1105 1496.5957 1511.4906 1524.0142 1524.4946 1549.3511 1565.2226 1579.1951 1584.6793 1589.4329 1600.5502 1608.7529 1621.3412 1646.4613 1668.2813 1706.2674 3117.0996 3118.9807 3119.9923 3121.1837 3121.6043 3123.0979 3127.2352 3127.3679 3141.1712 3142.5735 3143.1301 3144.0674 3146.3618 3151.1236 3178.4264 3204.8279
redmass: 6.4424 5.6496 5.3414 4.8326 5.2510 5.4440 5.2531 4.8641 4.8224 4.9602 6.1027 5.6130 4.8987 6.8871 4.7328 4.7156 4.3529 6.3277 6.2101 5.7181 7.5694 5.7356 6.7028 7.0880 4.5871 6.6181 4.1180 4.8737 4.4996 4.1026 4.9367 3.8382 4.6137 4.8154 4.2094 6.2934 6.5616 4.6173 4.3255 6.9333 4.0421 8.6385 4.1982 7.1023 3.4401 7.0271 3.5591 6.1128 6.5584 5.9760 3.9860 5.6632 2.8449 2.1143 1.6785 1.5020 5.8246 5.5648 2.4822 6.8074 2.2962 3.6303 3.6856 2.8914 1.8494 4.6441 1.6365 1.6714 6.5210 1.4784 5.7728 1.6329 5.3147 1.4519 1.4044 1.8671 3.4018 1.8679 1.7226 2.1587 1.5067 1.9568 2.0262 3.8220 3.5424 3.4407 1.9642 2.7872 1.8915 1.5767 1.6338 1.5692 1.7066 1.4623 1.6362 1.8509 2.5457 1.9760 1.6786 1.7681 2.0090 1.8380 2.4418 2.5789 2.7917 3.7076 2.9733 5.7580 3.4320 3.9831 4.7666 3.5100 4.5513 5.6247 2.4814 2.1456 3.7975 5.4363 4.2286 3.6552 3.8124 5.3468 5.3368 4.1746 4.8135 4.1305 4.5251 6.6471 5.5298 7.7733 8.7313 6.4316 5.5898 7.4050 7.4433 7.7538 7.0444 11.1244 11.0221 11.8480 1.0865 1.0866 1.0869 1.0872 1.0863 1.0891 1.0912 1.0878 1.0967 1.0961 1.0971 1.0950 1.0978 1.0961 1.0928 1.0906
irintensity: 1.8759 0.0246 1.9757 0.8461 0.4741 0.1725 0.3244 0.8872 5.0425 0.9643 0.0625 1.7486 0.0941 0.0509 0.3799 0.1087 0.1031 0.7238 0.7039 5.5428 0.3689 2.6498 0.0943 0.5757 0.3990 1.2730 0.5519 1.1242 0.1877 0.3588 0.2751 1.7025 3.5086 2.5701 8.8201 1.7157 0.7756 0.4262 0.3530 0.3671 23.2925 0.6925 4.3993 0.5179 0.0693 1.7823 5.5435 0.2016 1.7368 7.7234 2.2224 7.0790 20.8827 14.8848 1.3301 1.3759 0.2880 1.4520 0.4960 6.0345 4.4294 2.1163 2.1067 0.4470 0.6675 0.0732 54.0786 184.4998 7.1692 7.5756 2.4931 30.2338 1.5934 0.2211 1.2202 0.1624 2.4720 3.8490 0.7250 0.9400 0.4105 0.6860 0.9898 0.2532 11.2871 4.0489 0.4402 9.5397 4.0849 1.4568 10.8054 13.4009 4.4247 4.0015 0.1901 4.7697 15.8996 6.1564 0.6542 4.8368 5.3964 7.1956 7.6020 4.0445 18.2699 5.3927 29.3342 4.0154 3.8703 14.4290 1.3102 7.2872 1.0047 0.9428 2.1576 0.6110 8.0641 0.0872 1.8149 0.5749 1.1868 1.5448 18.9613 11.0704 24.6548 16.2087 1.9861 26.9480 11.6644 4.7866 20.9131 1.0787 15.2197 7.1437 0.8268 8.4712 0.3147 0.1548 6.0856 9.9238 1.7304 3.8769 2.2694 2.9744 1.3340 14.5944 9.8478 1.6903 13.1302 66.7988 25.3517 78.2417 56.8754 53.1733 6.7817 10.4830
temp: 298.150 k
press: 1.00000 atm
elementType: 6 6 6 6 6 6 6 6 6 6 6 6 6 6 6 6 6 6 6 6 6 6 6 6 6 6 6 6 6 6 6 6 6 6 6 6 6 6 1 1 1 1 1 1 1 1 1 1 1 1 1 1 1 1
symmnumber: 1
zpe: 1064307.7 jmol-1
zpe.correction: 0.405373 hartree
zpe.thermalcorrener: 0.427728 hartree
zpe.thermalcorrenthalpy: 0.428672 hartree
zpe.thermalcorrgfe: 0.356319 hartree
zpe.sumelectzpe: -1455.419594 hartree
zpe.sumelectthermal: -1455.397240 hartree
zpe.sumelectthermalent: -1455.396296 hartree
zpe.sumelectthermalfe: -1455.468649 hartree
dipole: -0.9903 0.1902 -0.5863
dipole: 1.1665
quadrupole: -176.0205 -179.8243 -226.8421
quadrupole: 1.1676 -1.3592 0.8901
quadrupole: 18.2085 14.4047 -32.6131 1.1676 -1.3592 0.8901
hfenergy: -1455.8249679 hartree
pointgroup: C01 [X(C38H16)]
dipole: 0.3879504 0.0784435 0.2322715 debye
polarizability: 863.0266265|11.424886|568.8347876|3.3995273|-0.880838|146.7990244 unknown
InChI: InChI=1S/C38H16/c1-2-17-4-5-18-10-11-22-16-26-23-14-12-20-8-6-19-7-9-21-13-15-25-33-24(3-1)27(17)28(18)32(22)37(33)36(26)38-34(23)30(20)29(19)31(21)35(25)38/h1-16H
charge 0 multiplicity 1
54 atoms
C  -1.188115 -0.428127 -0.29324
C  0.004479 -1.12404 -0.247482
C  1.210616 -0.421957 -0.154728
C  -1.302088 0.951792 -0.170626
C  -2.251781 -1.355796 -0.278626
C  -0.250732 -2.557703 -0.203217
C  1.20648 1.036238 -0.136678
C  -1.769129 -2.694047 -0.233422
C  -0.089599 1.739992 -0.06898
C  2.369346 -1.258533 -0.033659
C  -2.653088 1.440995 -0.066743
C  -3.567052 -0.904025 -0.182969
C  -3.772033 0.51897 -0.088082
C  3.648429 -0.638415 0.079945
C  2.553806 1.644162 -0.172075
C  2.206052 -2.698089 0.006109
C  3.734742 0.802966 -0.009324
C  0.893622 -3.344074 -0.078886
C  -2.861346 2.836407 0.12508
C  -4.60076 -1.888706 -0.103611
C  -5.109813 0.997434 0.055694
C  -0.36732 3.148731 0.176637
C  -2.802652 -3.673394 -0.159812
C  4.817155 -1.459578 0.231041
C  -1.670765 3.655096 0.253337
C  -4.174335 -3.265699 -0.11215
C  5.050954 1.397119 0.023322
C  3.396953 -3.481323 0.16301
C  -4.216005 3.305508 0.242059
C  -5.949016 -1.366944 0.012161
C  2.778677 3.026656 -0.421377
C  -5.301636 2.415783 0.202709
C  -6.179423 0.01086 0.080691
C  4.656225 -2.882965 0.273181
C  6.107239 -0.822296 0.31453
C  6.213262 0.55418 0.208796
C  5.200166 2.801056 -0.152572
C  4.071839 3.596431 -0.405839
H  0.858794 -4.438486 -0.018679
H  0.445417 3.848882 0.377906
H  -2.578692 -4.74574 -0.123245
H  -1.801765 4.724516 0.460126
H  -4.94048 -4.048461 -0.053857
H  3.309889 -4.573721 0.199497
H  -4.400553 4.377466 0.380504
H  -6.797801 -2.059443 0.060021
H  1.941687 3.670223 -0.690263
H  -6.321558 2.805507 0.306605
H  -7.209969 0.374348 0.178117
H  5.549247 -3.507971 0.389158
H  7.00072 -1.443375 0.445703
H  7.196005 1.038354 0.252257
H  6.202339 3.243841 -0.123149
H  4.187864 4.667598 -0.602604
