program: Gaussian 09
title: 000144783
version: EM64L-G09RevD.01
frameworkgroup: C1[X(C7H5P)]
method: RPBEPBE
basis: SDD
operation: Freq
keyword: #p
keyword: freq=noraman
keyword: PBEPBE/SDD
title: #p freq=noraman PBEPBE/SDD
converged: NO NO NO NO
title: Mulliken charges:
elementType: P C C C C C C C H H H H H
charge: 0.395070 0.382734 -0.389264 -0.389284 -0.216681 -0.216672 -0.230250 -0.538960 0.250840 0.250843 0.233839 0.233839 0.233945
chargesum: 0.00000
title: Mulliken charges with hydrogens summed into heavy atoms:
elementType: P C C C C C C C
charge: 0.395070 0.382734 -0.138424 -0.138441 0.017158 0.017167 0.003696 -0.538960
polarizability: 1.79152394e+02 -1.30667829e-03 8.27401111e+01 1.42376465e-03 -5.14394909e-05 3.88662691e+01
1716.lowfreq: -3.7704 0.0003 0.0018 0.0021 5.9627 25.4960 113.8776 115.2547 337.3803
frequency: 113.8311 115.2325 337.3797 380.8443 397.4569 495.3575 530.4934 614.3202 694.2964 698.3844 773.9802 850.6574 933.5645 982.0241 982.1725 1001.4402 1017.6406 1077.3793 1081.0997 1174.4318 1187.8466 1308.9114 1362.6365 1427.5107 1445.7519 1564.9809 1575.5873 1606.0422 3125.8483 3135.6208 3148.1025 3158.0418 3167.7803
redmass: 5.8895 6.4755 5.2999 10.2842 2.8252 7.6918 3.5988 6.5766 1.7995 6.6602 1.7636 1.2467 1.4275 6.2096 1.3850 1.3301 2.8203 1.6276 3.2919 1.0580 1.1196 1.4295 4.9955 2.3321 2.0139 5.4384 7.6116 7.3341 1.0850 1.0884 1.0931 1.0968 1.1015
irintensity: 1.3740 0.9816 5.2063 0.5462 0.0000 10.2158 1.7107 0.0189 45.7092 4.7037 82.3500 0.0000 7.9722 0.5152 0.0000 0.3241 7.6502 10.6035 0.0065 0.0004 1.4254 0.0283 0.5519 7.7720 26.2529 2.1497 14.5169 23.8197 0.2452 4.2367 15.5766 25.7933 16.4337
temp: 298.150 k
press: 1.00000 atm
elementType: 15 6 6 6 6 6 6 6 1 1 1 1 1
symmnumber: 1
zpe: 248025.6 jmol-1
zpe.correction: 0.094468 hartree
zpe.thermalcorrener: 0.101023 hartree
zpe.thermalcorrenthalpy: 0.101967 hartree
zpe.thermalcorrgfe: 0.062905 hartree
zpe.sumelectzpe: -610.399251 hartree
zpe.sumelectthermal: -610.392696 hartree
zpe.sumelectthermalent: -610.391751 hartree
zpe.sumelectthermalfe: -610.430814 hartree
dipole: 2.3534 0.0002 0.0000
dipole: 2.3534
quadrupole: -50.4945 -47.2376 -57.5074
quadrupole: -0.0003 -0.0001 0.0002
quadrupole: 1.2520 4.5089 -5.7609 -0.0003 -0.0001 0.0002
hfenergy: -610.4937187 hartree
pointgroup: C01 [X(C7H5P1)]
dipole: -0.9258971 -0.000058 -0.0000098 debye
dipolederiv: -0.4678478 -0.0000036 0.0000092 0.0000334 0.0888156 -0.0000002 0.0000104 0.0000006 0.0893336 -0.1566652 -0.0000103 0.0000013 -0.0000276 0.140585 0.0000013 0.0000294 0.0000037 0.1716223 -0.0131631 0.0965725 -0.0000035 -0.0967155 0.0504969 -0.0000067 -0.0000054 -0.0000185 -0.1461437 -0.0131679 -0.0965642 -0.0000007 0.0967248 0.0504791 0.0000014 0.0000075 -0.0000042 -0.146144 -0.0843513 -0.1361107 0.0000045 -0.1624253 0.0655867 -0.0000026 0.0000083 -0.0000157 -0.1466677 -0.0843755 0.1361045 -0.0000031 0.1624138 0.0656069 -0.0000102 -0.0000091 0.0000012 -0.1466653 0.0598541 0.0000022 0.0000068 -0.0000015 -0.0098344 0.0000031 -0.000003 0.0000069 -0.1504418 0.7534852 0.0000038 -0.0000134 -0.0000024 -0.3656764 0.0000004 -0.0000398 -0.0000038 -0.3282573 0.0553281 -0.0856203 0.0000024 -0.0557669 -0.0261645 0.000003 0.0000075 0.0000202 0.1598436 0.0553167 0.0856194 0.0000008 0.0557689 -0.026161 0.0000014 0.0000026 0.0000022 0.1598429 0.0107385 0.0832612 -0.0000055 0.1064199 -0.0621855 0.0000043 -0.0000082 0.0000065 0.1606389 0.0107527 -0.0832492 0.000001 -0.1064161 -0.0621984 0.0000029 0.0000028 0.000001 0.1606384 -0.1259045 -0.0000052 0. -0.0000056 0.09065 0.0000018 -0.000003 0. 0.1624001 unknown
polarizability: 179.1523938|-0.0014152|82.7401111|-0.0014238|0.0000514|38.8662691 unknown
InChI: InChI=1S/C7H5P/c8-6-7-4-2-1-3-5-7/h1-5H
charge 0 multiplicity 1
13 atoms
P  3.551391 -0.000029 -0.000053
C  0.523565 0.000032 -0.000032
C  -0.204014 1.231153 0.000033
C  -0.203946 -1.231117 -0.000003
C  -1.614183 1.225531 -0.000012
C  -1.614117 -1.225582 0.000009
C  -2.324658 -0.000051 0.000006
C  1.956215 0.000077 -0.000036
H  0.349154 2.176399 0.00001
H  0.349252 -2.176338 0.000006
H  -2.159342 2.176227 -0.000053
H  -2.159205 -2.176322 0.000018
H  -3.420812 -0.000079 0.000007
