program: Gaussian 09
title: 000144782
version: EM64L-G09RevD.01
frameworkgroup: C1[X(C4H3Cl3OS)]
method: RPBEPBE
basis: SDD
operation: Freq
keyword: #p
keyword: freq=noraman
keyword: PBEPBE/SDD
title: #p freq=noraman PBEPBE/SDD
converged: YES YES NO NO
title: Mulliken charges:
elementType: Cl Cl Cl S O C C C C H H H
charge: 0.035218 0.090488 0.066312 0.127664 -0.153429 -0.167511 0.091688 -0.504363 -0.339581 0.248584 0.257087 0.247843
chargesum: 0.00000
title: Mulliken charges with hydrogens summed into heavy atoms:
elementType: Cl Cl Cl S O C C C C
charge: 0.035218 0.090488 0.066312 0.127664 -0.153429 -0.167511 0.091688 0.249150 -0.339581
polarizability: 1.06769614e+02 4.87893293e+00 9.23723718e+01 1.18247289e+01 2.90361658e+00 8.41973143e+01
1716.lowfreq: -6.4223 -0.0022 -0.0008 0.0008 5.4985 9.6784 20.8046 70.2328 96.7942
frequency: 20.6517 70.2233 96.7396 108.0219 135.7478 156.8298 175.1523 208.9541 271.3902 326.0427 357.7569 407.6980 454.6987 553.4273 563.9266 710.2208 792.6122 868.4932 919.0348 1093.8963 1124.7807 1174.1402 1194.0897 1428.1564 1455.1363 1464.0448 1615.6847 3002.2198 3111.8431 3152.0281
redmass: 8.8028 16.6372 1.4573 11.8161 6.3687 2.1527 13.7710 10.8574 18.0998 8.1081 16.9051 7.9456 10.3330 13.4295 11.9412 11.6112 10.3271 10.7002 10.4450 1.2511 1.6581 6.9818 5.2229 1.1621 1.0507 1.0501 11.8585 1.0296 1.1060 1.1037
irintensity: 0.7004 0.8727 2.6692 0.5768 2.8088 3.9752 0.6326 0.1869 0.5257 4.5324 2.1115 1.3862 9.7081 13.0735 5.7969 63.1958 143.0708 17.4175 7.6522 2.4169 12.2874 395.6850 16.7965 12.8889 25.3816 20.5288 23.3178 27.6245 15.0583 12.7737
temp: 298.150 k
press: 1.00000 atm
elementType: 17 17 17 16 8 6 6 6 6 1 1 1
symmnumber: 1
zpe: 161577.5 jmol-1
zpe.correction: 0.061542 hartree
zpe.thermalcorrener: 0.072507 hartree
zpe.thermalcorrenthalpy: 0.073451 hartree
zpe.thermalcorrgfe: 0.021965 hartree
zpe.sumelectzpe: -2006.935963 hartree
zpe.sumelectthermal: -2006.924998 hartree
zpe.sumelectthermalent: -2006.924054 hartree
zpe.sumelectthermalfe: -2006.975540 hartree
dipole: 1.3572 0.4039 3.4924
dipole: 3.7686
quadrupole: -86.3561 -79.3162 -74.1593
quadrupole: -1.4464 -4.3416 0.1382
quadrupole: -6.4123 0.6276 5.7846 -1.4464 -4.3416 0.1382
hfenergy: -2006.997505 hartree
pointgroup: C01 [X(C4H3Cl3O1S1)]
dipole: 0.3453695 -0.1869503 -1.4297161 debye
dipolederiv: -0.1421593 0.0614691 0.0421469 0.025802 -0.6176734 -0.0373516 0.0244282 0.0157076 -0.0215214 -0.7449038 0.1787463 0.090356 0.2561728 -0.1697995 -0.0044546 0.0253 0.0088159 0.0593584 -0.1624503 0.0410301 0.0150312 -0.0092535 -0.688036 0.0788208 0.0079143 0.062923 0.0236327 -0.4065919 0.0379873 0.1930081 0.1199483 -0.1142533 -0.1170587 0.1244728 -0.0463452 -0.6463476 -0.472144 -0.0457348 -0.6344145 0.0509814 -0.2158475 0.0206907 -0.1750438 -0.1134512 -1.4083747 0.7194171 -0.0360817 0.5280844 -0.271254 -0.0638047 0.0619715 0.1537876 0.1395505 1.5825857 -0.0598253 -0.0632861 -0.2024322 0.0909528 0.679996 0.0311449 -0.196609 -0.0467834 -0.0675027 0.2078394 0.0069684 -0.06253 0.023653 0.2374079 0.0790185 0.0610515 0.0457864 0.6420751 0.981426 -0.1836014 -0.049654 -0.2781096 0.8785643 -0.0826033 0.0165439 -0.0739757 -0.1455654 0.0177844 -0.0896271 0.1141871 -0.0975993 -0.0013063 0.0164466 0.0115497 -0.022557 -0.0095715 -0.0276953 0.0107191 -0.1106644 0.0234791 0.1327347 0.0026352 -0.0676384 -0.0040265 -0.0109177 0.0893031 0.0814108 0.0768815 0.0652271 -0.0579822 -0.0492599 0.0142433 0.0343555 0.0021492 unknown
polarizability: 103.3090053|-4.6190094|92.4007017|-14.363371|3.2281954|87.6295935 unknown
InChI: InChI=1S/C4H3Cl3OS/c1-8-4(9)2(5)3(6)7/h1H3
charge 0 multiplicity 1
12 atoms
Cl 0.382364 -2.262071 0.324869
Cl 3.025243 -0.320829 -0.068234
Cl 1.211844 2.105077 -0.097709
S  -1.753246 0.414388 1.944113
O  -1.946849 0.180767 -0.696572
C  -1.145676 0.06171 0.420575
C  0.249662 -0.447197 0.231171
C  -1.3920 -0.101858 -2.052755
C  1.356861 0.312936 0.038304
H  -0.636598 0.656802 -2.317483
H  -2.263159 -0.026032 -2.717477
H  -0.959246 -1.115493 -2.094603
