program: Gaussian 09
title: 000144781
version: EM64L-G09RevD.01
frameworkgroup: C1[X(C6H8N2OS)]
method: RPBEPBE
basis: SDD
operation: Freq
keyword: #p
keyword: freq=noraman
keyword: PBEPBE/SDD
title: #p freq=noraman PBEPBE/SDD
converged: YES YES NO NO
title: Mulliken charges:
elementType: S O N N C C C C C C H H H H H H H H
charge: 0.283408 -0.249676 -0.010106 0.024206 0.216434 -0.299020 -0.380266 -0.261093 -0.508868 -0.827106 0.257079 0.253775 0.235868 0.237737 0.237636 0.272324 0.272255 0.245415
chargesum: 0.00000
title: Mulliken charges with hydrogens summed into heavy atoms:
elementType: S O N N C C C C C C
charge: 0.283408 -0.249676 -0.010106 0.024206 0.216434 -0.041941 -0.380266 -0.007318 0.202372 -0.037113
polarizability: 1.33488879e+02 7.15416271e+00 1.19463312e+02 6.55922506e-03 2.75067786e-03 4.75994646e+01
1716.lowfreq: -9.3709 -8.4727 -0.0027 -0.0008 0.0018 3.6908 67.4563 107.1230 117.9185
frequency: 67.4448 107.1126 117.9103 130.4700 131.6305 168.1999 224.4082 227.7760 347.8623 403.4095 437.7217 449.8595 580.6908 643.0206 659.5629 689.8538 765.0013 828.8423 853.0365 926.8675 962.2410 974.6695 977.3659 992.7316 1062.0473 1111.7300 1143.8933 1191.7278 1260.0079 1285.5589 1299.8430 1347.6060 1381.0910 1436.1204 1438.4450 1450.1668 1450.8970 1464.0405 1522.2425 1533.2111 3002.6230 3021.9875 3104.5803 3145.1787 3145.9139 3151.3450 3151.7292 3203.8207
redmass: 3.1397 1.3653 1.4683 1.4997 3.4560 4.5072 3.2640 6.1381 5.7894 8.4302 3.5607 6.2682 5.7872 5.9912 7.1786 8.4241 5.2430 1.4775 6.9270 9.6684 1.3945 4.9613 1.1795 1.4003 1.6513 1.2536 1.4960 2.6592 8.6229 3.8491 2.8869 1.2020 1.7120 1.0532 1.3711 1.0517 1.0692 1.0574 5.8699 5.6838 1.0294 1.0282 1.1045 1.1043 1.1043 1.1056 1.0919 1.0966
irintensity: 0.9805 0.4273 3.3492 2.2412 0.0693 5.8362 7.7329 6.2345 13.5065 3.8324 0.9368 0.1161 2.8092 0.1503 0.1482 9.3252 0.0563 53.1699 52.6387 7.5011 0.0821 72.0649 9.0003 0.0137 6.6383 0.2412 33.8424 105.0412 12.6457 151.8402 84.1003 9.0857 206.6038 11.9236 18.3249 18.0027 20.1673 34.1374 223.4505 294.5405 35.2027 22.2069 28.5637 30.8098 2.7061 14.2787 19.8046 2.2487
temp: 298.150 k
press: 1.00000 atm
elementType: 16 8 7 7 6 6 6 6 6 6 1 1 1 1 1 1 1 1
symmnumber: 1
zpe: 352739.8 jmol-1
zpe.correction: 0.134352 hartree
zpe.thermalcorrener: 0.144794 hartree
zpe.thermalcorrenthalpy: 0.145739 hartree
zpe.thermalcorrgfe: 0.097728 hartree
zpe.sumelectzpe: -815.455030 hartree
zpe.sumelectthermal: -815.444587 hartree
zpe.sumelectthermalent: -815.443643 hartree
zpe.sumelectthermalfe: -815.491654 hartree
dipole: 2.0851 -2.8524 0.0016
dipole: 3.5333
quadrupole: -67.1797 -57.4060 -67.7612
quadrupole: 6.2925 0.0009 0.0010
quadrupole: -3.0641 6.7096 -3.6456 6.2925 0.0009 0.0010
hfenergy: -815.5893819 hartree
pointgroup: C01 [X(C6H8N2O1S1)]
dipole: -0.8421537 -1.1055321 0.0304011 debye
dipolederiv: -0.5687669 0.397616 0.0323411 0.2629152 -0.0623879 -0.0140895 0.0307816 -0.0217276 -0.0697748 -0.9227975 -0.6225754 0.0243062 -0.6260597 -1.114165 0.0234404 0.02415 0.0234023 -0.3248649 -1.4439184 -0.124812 0.0689547 -0.1974208 -0.4229575 0.007128 0.0683886 0.0030029 -0.1416451 -0.9430858 0.1261263 0.0425167 0.7127372 -0.8565767 -0.0473202 0.050068 -0.0157168 -0.1900975 1.3173832 0.6528149 -0.0509774 0.6503345 1.0840336 -0.0239714 -0.0509764 -0.0240279 0.2165008 -0.371564 -0.0826485 0.0104099 -0.4313515 -0.6256867 0.017204 0.0056008 -0.0014782 -0.161375 1.6518831 -0.4833779 -0.0965068 -0.5647273 0.6698257 0.0394299 -0.0976789 0.0352296 -0.0046496 0.835368 0.0923659 -0.0460821 -0.0625517 0.5024604 0.0103492 -0.0479698 0.0022044 -0.0390662 0.2538132 0.0254218 0.0010405 0.258182 0.7033517 -0.0079863 0.0039473 0.004284 0.269186 0.0122453 -0.0740387 0.0006988 -0.0416764 0.1549494 0.0034341 0.0011121 0.0052737 0.0466143 -0.0213428 0.0621092 0.01212 0.0447573 0.094887 -0.0035793 0.0119432 -0.0045305 0.1886176 0.0829556 0.0337262 0.0029462 0.0645933 -0.0961869 -0.0063899 0.0034323 -0.0047598 0.1296831 -0.0992328 -0.1285511 0.0107562 -0.0761575 0.0253528 0.0028611 0.0114105 0.0057252 0.1245617 0.0638265 0.0970435 -0.1092397 -0.0324186 -0.0233954 0.0172832 -0.0849816 0.0484365 -0.0483204 0.083728 0.088396 0.0970805 -0.0363188 -0.0219513 -0.0127841 0.0694264 -0.05777 -0.0702964 0.0672698 -0.0807679 -0.1047388 -0.0074812 -0.0216598 -0.0448064 -0.0752818 -0.0346626 -0.0182669 0.0859518 -0.0789454 0.091039 -0.0040555 -0.0242202 0.0458618 0.063553 0.0439068 -0.035052 -0.0837161 0.1000972 0.0133352 0.0866995 0.0343268 -0.0060646 0.0130745 -0.0067917 0.1282454 unknown
polarizability: 132.9383799|-7.3662222|119.7422424|-4.704468|1.3411065|47.8710332 unknown
InChI: InChI=1S/C6H8N2OS/c1-9-5-3-4-7-6(8-5)10-2/h3-4H,1-2H3
charge 0 multiplicity 1
18 atoms
S  2.792823 -0.127334 -0.24798
O  -2.2729 -0.831474 0.016872
N  0.06338 -0.467849 -0.10417
N  0.93979 1.806608 -0.122013
C  -1.197574 0.030468 -0.02963
C  -1.470081 1.424366 0.002366
C  1.074635 0.451019 -0.146909
C  -0.347483 2.270752 -0.047035
C  -1.980471 -2.281785 -0.018176
C  2.537046 -1.990165 -0.258905
H  -2.492394 1.799551 0.061977
H  -0.460852 3.359456 -0.026838
H  -2.96977 -2.758354 0.030479
H  -1.356119 -2.571248 0.843766
H  -1.455762 -2.548062 -0.951115
H  1.933947 -2.280686 -1.130424
H  2.035636 -2.305167 0.666879
H  3.547749 -2.422896 -0.321741
