program: Gaussian 09
title: 000144774
version: EM64L-G09RevD.01
frameworkgroup: C1[X(C11H9F3O)]
method: RPBEPBE
basis: SDD
operation: Freq
keyword: #p
keyword: freq=noraman
keyword: PBEPBE/SDD
title: #p freq=noraman PBEPBE/SDD
converged: NO YES NO NO
title: Mulliken charges:
elementType: F F F O C C C C C C C C C C C H H H H H H H H H
charge: -0.163820 -0.164097 -0.163981 -0.226629 0.295810 0.504887 -0.377601 -0.325360 -0.360305 -0.375499 0.256290 -0.256921 -0.289088 0.185782 -0.783420 0.267665 0.264112 0.236329 0.248407 0.272781 0.221855 0.236818 0.259065 0.236916
chargesum: 0.00000
title: Mulliken charges with hydrogens summed into heavy atoms:
elementType: F F F O C C C C C C C C C C C
charge: -0.163820 -0.164097 -0.163981 -0.226629 0.295810 0.504887 -0.109935 -0.061248 -0.123975 -0.127092 0.256290 0.015860 -0.067233 0.185782 -0.050620
polarizability: 2.37986153e+02 7.83938376e+00 1.20755538e+02 1.04421507e-03 -2.77636206e-02 6.04036371e+01
1716.lowfreq: -19.0359 -8.1025 -3.0014 -0.0011 -0.0007 0.0005 3.6367 33.4399 47.7729
frequency: -18.9292 33.3920 47.7630 71.7207 100.2392 120.0637 143.1482 165.9855 194.6745 254.0695 277.9521 356.1598 364.5613 375.5882 400.5856 463.3189 470.0037 520.2114 546.0795 553.4537 584.5308 612.7611 632.3426 698.0790 740.8993 823.5334 833.2066 845.2629 886.7017 906.8942 958.7264 967.5702 979.0107 989.3229 990.3100 1014.9091 1019.9430 1030.2483 1031.3973 1132.9283 1182.5685 1197.1694 1222.0331 1284.7374 1297.5075 1313.7618 1325.7936 1367.4678 1384.2074 1417.4774 1442.2910 1454.6209 1507.6039 1569.0318 1576.0818 1622.8040 1652.3074 2977.7128 3059.4645 3095.6209 3119.2912 3126.9731 3141.1668 3150.2420 3165.8280 3175.9007
redmass: 7.1442 3.8448 7.9575 5.6046 1.0688 4.4296 3.3452 7.3668 10.6758 4.8443 4.7328 8.4565 5.8161 6.0115 2.7904 4.6979 4.0970 8.5135 3.2915 5.8783 2.7318 7.7355 7.1016 7.7267 3.5355 5.4940 1.4683 1.2968 1.7762 3.1366 1.9329 1.4742 1.7716 4.5788 4.5215 1.2831 4.9946 1.6554 3.5535 1.4710 2.3056 1.1839 1.4826 5.2197 1.6975 1.9430 1.3192 1.2671 4.8228 3.3777 1.0909 1.0501 2.6271 7.2963 6.7589 6.1560 5.7592 1.0378 1.0963 1.0901 1.0911 1.0989 1.0890 1.0886 1.0967 1.0964
irintensity: 0.0985 0.8912 6.0610 2.8830 0.0483 0.1768 0.2061 3.1657 0.2238 0.0280 5.0869 18.2209 1.5015 1.6588 0.0362 3.2258 2.8848 1.3787 6.1119 6.8584 10.6246 24.1757 0.8091 0.3079 0.0487 6.7216 80.9747 14.6068 3.6939 11.4998 63.7732 45.5224 54.0749 148.3325 141.9834 61.7244 148.6317 1.6110 90.8682 1.8689 109.6776 1.0642 35.9194 473.4658 15.4224 99.4029 14.7646 75.0237 29.1340 21.0091 27.6711 21.2862 1.6247 177.5700 36.8959 28.2564 89.9276 2.7247 13.4651 0.3785 9.0751 21.5610 5.0202 5.1128 4.8770 1.6765
temp: 298.150 k
press: 1.00000 atm
elementType: 9 9 9 8 6 6 6 6 6 6 6 6 6 6 6 1 1 1 1 1 1 1 1 1
symmnumber: 1
zpe: 448403.5 jmol-1
zpe.correction: 0.170788 hartree
zpe.thermalcorrener: 0.184250 hartree
zpe.thermalcorrenthalpy: 0.185194 hartree
zpe.thermalcorrgfe: 0.129113 hartree
zpe.sumelectzpe: -798.234016 hartree
zpe.sumelectthermal: -798.220554 hartree
zpe.sumelectthermalent: -798.219610 hartree
zpe.sumelectthermalfe: -798.275691 hartree
dipole: 1.9237 2.3929 -0.0110
dipole: 3.0703
quadrupole: -108.3493 -79.0892 -89.8412
quadrupole: 16.2259 0.0626 -0.0152
quadrupole: -15.9228 13.3374 2.5854 16.2259 0.0626 -0.0152
hfenergy: -798.404804 hartree
pointgroup: C01 [X(C11H9F3O1)]
dipole: -0.7445677 0.9509601 -0.0204505 debye
dipolederiv: -0.6092287 -0.209479 -0.0071457 -0.2449255 -0.7202574 -0.0132088 -0.0020902 -0.0102121 -0.2870161 -0.810788 0.0965468 -0.2141323 0.1931066 -0.3625058 0.1947013 -0.2764618 0.1673657 -0.6338824 -0.8309609 0.090051 0.2123692 0.18394 -0.3507031 -0.1822114 0.2918098 -0.1582387 -0.6403194 -0.9673474 -0.0350768 -0.0075182 -0.5009088 -0.7476279 0.0018345 0.0006546 0.0074217 -0.3127297 -0.6812711 -0.0178065 -0.0069402 -0.1723453 -0.0259163 -0.0040465 -0.0175712 -0.0025439 -0.1644579 0.0587625 -0.0428832 0.0011749 -0.0898998 0.0218797 -0.0006413 0.0026332 -0.0003037 0.0395381 0.0293227 0.1381631 -0.0003754 0.0224235 0.0298023 -0.0018209 0.0035387 0.0002752 -0.1019744 0.1155373 -0.1678066 0.0054156 -0.0193219 0.0164198 -0.0017058 0.0054906 -0.0045544 -0.0908099 -0.1457514 -0.1394923 0.0014811 -0.0495057 -0.007189 -0.0017722 0.0002052 -0.0030763 -0.1223861 -0.1846991 0.1815365 -0.0034604 0.0251707 0.0600516 -0.0032655 -0.0002213 -0.0009614 -0.147385 2.6223654 0.0455502 0.0135267 -0.0041279 1.3549444 0.0032516 -0.0016902 0.0029475 1.5589515 0.5988707 -0.0054399 0.0083312 -0.0962622 0.1373383 -0.004936 0.0099261 -0.0036697 -0.0659027 -1.4043398 0.1458975 -0.0175396 0.3655445 0.0171628 0.0005193 -0.0214003 -0.0020954 -0.2087571 2.1520998 -0.2544177 0.0298645 0.1819873 0.869918 -0.0113034 0.022528 -0.0165979 0.1313745 -0.3097924 0.2363068 -0.0088417 0.4078527 -0.3548325 0.0123095 -0.0115196 0.0098199 0.0500305 0.0817462 -0.0451014 -0.0002626 -0.055125 0.0036104 0.0016964 -0.0001025 0.0015251 0.1596989 0.0368505 0.0700388 -0.0024507 0.0753017 0.0226367 0.0029195 -0.0030726 0.0031908 0.1574029 0.0274539 0.0965317 -0.0027658 0.0720854 -0.0106782 0.0029878 -0.0027159 0.003318 0.143108 0.0479931 -0.0859862 -0.0000009 -0.0620366 -0.027101 0.0020533 -0.0007111 0.0018329 0.1547161 0.0788273 -0.0123424 -0.0005747 -0.0338214 -0.0210401 0.002555 -0.0005084 0.0027306 0.1470351 0.0680267 -0.0528691 -0.0002127 -0.0645124 -0.0897839 0.0037125 -0.0000668 0.0037938 0.1592224 0.0670773 -0.0071538 0.0720064 -0.0233128 0.0590161 0.0852938 0.0283014 0.1041825 -0.0267071 -0.1108258 -0.0184116 -0.0030928 -0.0896925 0.0721444 -0.0004355 -0.0021188 0.0007399 0.1242034 0.0700711 -0.0063561 -0.0688562 -0.0216147 0.0527108 -0.0884872 -0.0248369 -0.10689 -0.0229534 unknown
polarizability: 237.7377526|-9.3175173|120.9586655|2.2914603|-1.0907607|60.4489101 unknown
InChI: InChI=1S/C11H9F3O/c1-8(15)2-3-9-4-6-10(7-5-9)11(12,13)14/h2-7H,1H3
charge 0 multiplicity 1
24 atoms
F  4.093407 1.453597 0.046452
F  4.234354 -0.531228 1.140417
F  4.249895 -0.487153 -1.120411
O  -4.931611 -1.133784 -0.062854
C  2.148277 -0.007687 0.006418
C  -0.680388 -0.286336 -0.024389
C  1.325042 1.143366 -0.02096
C  1.568661 -1.299615 0.018654
C  -0.073116 1.002967 -0.035893
C  0.169319 -1.43105 0.003592
C  3.644451 0.114539 0.018532
C  -2.134305 -0.493446 -0.039183
C  -3.115438 0.460768 -0.068715
C  -4.559883 0.078064 -0.080095
C  -5.563897 1.223107 -0.114001
H  1.781145 2.137443 -0.029427
H  2.20602 -2.189205 0.041044
H  -0.697199 1.901879 -0.056259
H  -0.2804 -2.430168 0.013501
H  -2.485368 -1.536541 -0.024905
H  -2.884719 1.533837 -0.085128
H  -5.405204 1.850496 -1.01211
H  -6.590421 0.827209 -0.122619
H  -5.431522 1.880142 0.76704
