program: Gaussian 09
title: 000144767
version: EM64L-G09RevD.01
frameworkgroup: C1[X(C21H24N2O3)]
method: RPBEPBE
basis: SDD
operation: Freq
keyword: #p
keyword: freq=noraman
keyword: PBEPBE/SDD
title: #p freq=noraman PBEPBE/SDD
converged: YES YES NO NO
title: Mulliken charges:
elementType: O O O N N C C C C C C C C C C C C C C C C C C C C C H H H H H H H H H H H H H H H H H H H H H H H H
charge: -0.284719 -0.209285 -0.220599 -0.113913 -0.104550 -0.347606 -0.367414 -0.371628 -0.513755 -0.691154 0.208497 0.358472 0.302451 -0.482514 0.129057 -0.288975 -0.382018 -0.332605 -0.332165 0.155905 0.174782 -0.280671 -0.315067 -0.303124 -0.368550 -0.684172 0.186088 0.194104 0.226112 0.213074 0.196757 0.203789 0.250012 0.250951 0.207549 0.217049 0.222159 0.232188 0.232568 0.304201 0.262630 0.278698 0.247858 0.278193 0.258039 0.278063 0.253105 0.209747 0.231087 0.231300
chargesum: 0.00000
title: Mulliken charges with hydrogens summed into heavy atoms:
elementType: O O O N N C C C C C C C C C C C C C C C C C C C C C
charge: -0.284719 -0.209285 -0.220599 -0.113913 -0.104550 0.032585 0.071772 0.028917 -0.012792 -0.044397 0.208497 0.358472 0.302451 -0.017759 0.129057 0.015226 -0.119387 -0.053906 -0.084307 0.155905 0.174782 -0.002477 -0.057028 -0.025061 -0.115445 -0.012038
polarizability: 6.45432817e+02 -2.44136488e+01 2.36125760e+02 4.88791213e+00 7.72168960e+00 1.31635062e+02
1716.lowfreq: -10.8382 -6.2056 -0.9697 -0.0025 -0.0023 0.0006 6.0604 16.0006 17.2880
frequency: 3.1680 15.8528 17.2293 24.7704 28.5499 39.8454 51.2984 57.0995 68.0542 78.4670 80.3869 99.9086 113.5643 124.4077 141.9463 153.8003 163.7196 195.8353 211.5226 227.2649 235.0877 260.5282 291.6390 310.5347 311.9154 325.8896 346.3199 380.6690 384.9108 406.0025 419.5198 453.6629 472.5079 486.8360 520.7600 527.8969 540.3932 557.6010 578.0623 614.7974 628.0967 642.0734 693.4940 717.3497 724.8551 730.6060 747.2213 753.0248 769.6353 805.4050 822.0935 829.4071 839.5819 850.3073 864.4149 871.6174 884.8619 899.3044 900.6324 947.2555 962.5769 975.1193 979.4633 980.5678 997.6877 1001.0720 1002.5582 1017.0986 1018.7621 1053.9214 1067.4689 1068.5142 1091.6523 1098.5209 1106.1140 1109.8915 1110.7967 1120.3593 1135.1320 1152.5173 1169.6164 1182.1723 1193.5825 1219.2573 1241.0013 1244.5030 1245.9014 1260.9864 1285.1110 1290.0815 1292.7762 1297.5694 1332.5958 1335.8946 1342.5533 1346.2630 1365.8215 1373.3558 1385.7565 1391.5502 1397.9421 1420.9667 1426.9482 1434.5547 1436.5038 1461.1215 1468.9981 1469.3129 1469.4003 1478.2740 1478.9086 1480.0869 1481.6990 1488.0862 1558.9507 1573.4782 1587.0567 1602.2368 1613.9595 1659.8711 2953.5932 2966.8287 2970.2047 2976.6090 2984.6034 2996.9826 2998.4183 3005.3929 3012.9574 3023.2597 3029.7811 3064.2945 3070.1650 3078.5819 3094.7800 3101.7976 3146.7732 3149.7729 3157.6183 3165.7831 3167.7559 3173.4807 3179.1724 3210.6338
redmass: 3.4373 3.8446 5.5104 5.0366 4.0491 4.8089 4.3550 4.6881 3.9271 1.9942 1.8462 4.0805 5.7174 3.0468 2.9190 4.1502 2.4757 1.3228 8.5649 3.7957 2.5924 2.0922 3.8370 5.6742 4.1863 4.3743 4.1306 4.4022 5.2472 2.9317 3.3056 3.6821 3.9283 3.0652 5.8620 2.7784 2.6452 6.3571 2.1866 7.1186 7.2635 5.6123 6.7810 3.6669 1.2314 3.5384 3.0150 3.8308 1.4127 1.5522 5.7939 1.5749 1.2856 1.3068 2.7897 1.5095 1.5332 6.4506 3.7974 4.4256 1.5185 1.3583 1.6669 1.3765 2.7049 2.6277 1.3264 1.3429 1.5497 3.7799 2.6712 1.6641 2.7170 2.3001 1.3538 1.3099 1.6017 2.2327 2.1024 1.6324 1.9294 1.5297 1.7317 2.5931 3.5109 1.3728 1.1886 1.2487 1.1754 1.3019 1.1064 1.3380 2.1248 1.5218 1.4632 5.9841 1.6214 5.5871 7.4518 1.2178 1.2113 4.4153 3.8762 1.0993 1.1053 1.0754 1.0392 1.0857 2.2818 1.0646 1.1036 2.3989 1.0577 1.0564 6.9798 7.8646 7.3972 6.4318 6.8896 10.1914 1.0594 1.0601 1.0619 1.0376 1.0611 1.0621 1.0363 1.0957 1.0979 1.1002 1.0985 1.1028 1.0996 1.0997 1.1003 1.0999 1.0875 1.0886 1.0885 1.0905 1.0963 1.0960 1.0973 1.0947
irintensity: 0.6560 0.1334 2.5501 0.0588 0.1785 0.6673 0.0195 0.3373 2.8786 0.8808 0.8174 0.0566 0.0301 0.4125 1.5733 2.2627 5.8989 0.0978 2.8453 1.2352 0.7558 3.8748 20.7222 2.3699 5.6705 4.7891 1.6987 0.4240 0.6134 0.1199 0.2055 1.5634 9.4864 0.0144 33.2777 5.2522 7.7384 0.4448 24.0947 1.7823 0.2275 1.1950 9.7327 12.6181 12.3471 0.3161 14.4137 7.9596 9.3349 27.6123 0.8390 4.3181 8.3602 1.6398 50.4151 47.8734 69.5258 0.4551 66.1343 121.4614 11.9480 0.0395 4.9817 1.7108 14.0519 3.1869 0.0790 0.1811 29.3468 218.3610 988.3517 1.7724 1.5878 0.6922 5.0293 42.3073 4.2196 262.0423 91.3610 120.0504 123.1939 2.4784 47.8809 428.6422 69.0098 27.9867 0.6051 16.0936 13.6157 5.7399 10.2261 13.6661 58.3187 36.7958 29.4308 87.4886 3.6137 1.0061 15.2802 17.0015 28.5402 35.0509 4.3244 23.7838 16.6735 5.3913 11.9091 11.0536 113.4083 21.1842 13.2698 2.3985 5.3697 16.9752 61.1512 4.3051 184.3829 142.6408 16.2940 170.7084 32.2016 45.3964 37.6597 26.1679 12.6561 28.8868 40.3046 33.6480 10.0426 30.1161 2.1146 47.9566 68.3968 72.5987 29.6336 30.5324 9.4396 0.7517 3.1324 1.9135 13.1153 1.1758 8.0111 1.5759
temp: 298.150 k
press: 1.00000 atm
elementType: 8 8 8 7 7 6 6 6 6 6 6 6 6 6 6 6 6 6 6 6 6 6 6 6 6 6 1 1 1 1 1 1 1 1 1 1 1 1 1 1 1 1 1 1 1 1 1 1 1 1
symmnumber: 1
zpe: 1057242.8 jmol-1
zpe.correction: 0.402683 hartree
zpe.thermalcorrener: 0.429280 hartree
zpe.thermalcorrenthalpy: 0.430224 hartree
zpe.thermalcorrgfe: 0.338448 hartree
zpe.sumelectzpe: -1147.878177 hartree
zpe.sumelectthermal: -1147.851580 hartree
zpe.sumelectthermalent: -1147.850636 hartree
zpe.sumelectthermalfe: -1147.942412 hartree
dipole: -4.1102 -0.8707 -0.2334
dipole: 4.2079
quadrupole: -146.1631 -147.0624 -156.2818
quadrupole: -31.3877 -2.8639 0.5068
quadrupole: 3.6727 2.7734 -6.4461 -31.3877 -2.8639 0.5068
hfenergy: -1148.2808598 hartree
pointgroup: C01 [X(C21H24N2O3)]
dipole: 1.6012475 -0.3465555 -0.2379115 debye
polarizability: 645.3083702|-14.1084407|171.0751384|24.540192|49.9970463|196.8101309 unknown
InChI: InChI=1S/C21H24N2O3/c1-3-5-6-7-21(25)26-19-14-12-18(13-15-19)23-22-17-10-8-16(9-11-17)20(24)4-2/h8-15H,3-7H2,1-2H3
charge 0 multiplicity 1
50 atoms
O  4.213861 0.266638 0.929804
O  4.826155 -1.177966 -0.834735
O  -8.420973 1.135554 0.781642
N  -2.102475 -0.110498 -0.091592
N  -1.429951 0.568549 0.805749
C  9.058449 -0.467677 0.289716
C  7.644348 -0.813062 -0.229161
C  10.198073 -1.182061 -0.478381
C  6.545246 -0.1329 0.609563
C  10.317247 -0.758222 -1.959985
C  5.143505 -0.439249 0.116435
C  2.799344 0.245137 0.781903
C  -6.357212 0.240395 -0.074536
C  -8.679442 -0.425474 -1.07487
C  -7.856596 0.374428 -0.058994
C  2.078546 -0.487119 -0.201121
C  2.13028 1.050401 1.734558
C  -5.599819 0.981268 0.880398
C  -5.671508 -0.591703 -1.001181
C  -0.012894 0.40752 0.735254
C  -3.522397 0.060966 -0.0179
C  0.676116 -0.398792 -0.214905
C  0.72885 1.130379 1.709114
C  -4.20174 0.898171 0.916001
C  -4.267576 -0.679675 -0.973238
C  -10.194146 -0.195149 -0.943882
H  9.215557 0.630205 0.231533
H  9.124972 -0.73713 1.364535
H  7.535291 -0.505822 -1.285502
H  7.496761 -1.910241 -0.210259
H  10.04482 -2.278964 -0.419122
H  11.157832 -0.973228 0.034786
H  6.607253 -0.441145 1.672378
H  6.672302 0.96772 0.615379
H  10.454306 0.3366 -2.046916
H  11.183361 -1.245578 -2.443899
H  9.416444 -1.032518 -2.538059
H  -8.332557 -0.158454 -2.094485
H  -8.438179 -1.501369 -0.95075
H  2.609211 -1.102647 -0.927506
H  2.722233 1.597054 2.473756
H  -6.149875 1.616301 1.582994
H  -6.228133 -1.17018 -1.744976
H  0.090605 -0.948133 -0.95813
H  0.181407 1.744616 2.430641
H  -3.610846 1.461013 1.644326
H  -3.719016 -1.312963 -1.677774
H  -10.743369 -0.794102 -1.692074
H  -10.445399 0.869127 -1.090286
H  -10.549472 -0.474819 0.062454
