program: Gaussian 09
title: 000144766
version: EM64L-G09RevD.01
frameworkgroup: C1[X(C22H26N2O3)]
method: RPBEPBE
basis: SDD
operation: Freq
keyword: #p
keyword: freq=noraman
keyword: PBEPBE/SDD
title: #p freq=noraman PBEPBE/SDD
converged: YES YES NO NO
title: Mulliken charges:
elementType: O O O N N C C C C C C C C C C C C C C C C C C C C C C H H H H H H H H H H H H H H H H H H H H H H H H H H
charge: -0.286366 -0.206076 -0.220386 -0.105068 -0.111967 -0.352710 -0.354505 -0.384985 -0.355011 -0.496182 -0.693691 0.208321 0.383332 0.304852 -0.384509 -0.304735 -0.481814 0.126415 0.160056 -0.263118 -0.335034 -0.327151 -0.338413 0.163678 -0.311213 -0.352505 -0.684518 0.192042 0.194930 0.192339 0.190915 0.215459 0.221776 0.195727 0.196440 0.231465 0.236098 0.210559 0.217534 0.210949 0.259049 0.306910 0.232958 0.232646 0.281213 0.254786 0.245762 0.281042 0.275898 0.254721 0.231557 0.230784 0.209742
chargesum: 0.00000
title: Mulliken charges with hydrogens summed into heavy atoms:
elementType: O O O N N C C C C C C C C C C C C C C C C C C C C C C
charge: -0.286366 -0.206076 -0.220386 -0.105068 -0.111967 0.034262 0.028749 0.052251 0.037156 -0.028619 -0.054650 0.208321 0.383332 0.304852 -0.125460 0.002175 -0.016210 0.126415 0.160056 0.018095 -0.080248 -0.081388 -0.057371 0.163678 -0.035315 -0.097784 -0.012435
polarizability: 6.48138139e+02 5.99462251e+01 2.29490626e+02 1.63977126e+01 -3.89721517e+01 1.74205127e+02
1716.lowfreq: -13.1065 -0.0016 -0.0005 0.0013 0.7556 2.9800 9.6836 13.2036 23.4848
frequency: 7.0313 12.9848 23.1457 26.8146 30.5036 37.5678 44.8370 52.6045 60.9943 69.8338 89.5860 101.7150 106.2562 119.0834 129.4817 131.1333 155.4771 165.8401 179.0777 194.6265 220.0681 230.3315 241.4094 252.9538 291.8477 311.7753 319.5705 339.7782 371.8689 390.1597 403.1104 409.4065 424.5593 437.8998 454.5937 489.1582 519.2284 527.4324 538.8551 578.9323 610.2302 621.7291 628.9677 653.6208 695.2898 724.6671 725.1744 731.1258 737.6958 746.8103 747.7213 795.8684 807.0229 821.3974 842.1632 853.7761 867.9506 878.2547 881.1485 883.7828 893.5278 900.0012 948.4087 979.1773 985.9954 993.3194 994.7718 997.5462 1001.4637 1006.2583 1008.2086 1009.0720 1019.5340 1056.8081 1067.4046 1069.4031 1076.6420 1090.8543 1104.6208 1109.8933 1112.4411 1133.4102 1148.1018 1165.9165 1174.0208 1193.3124 1200.1411 1220.4881 1230.1301 1240.7867 1248.3740 1248.8208 1279.7394 1281.7743 1288.2504 1290.1844 1295.7143 1296.5162 1320.2405 1334.2588 1345.5792 1346.5502 1354.5016 1374.2129 1385.1258 1390.6512 1397.2406 1419.3322 1427.7729 1436.2484 1450.6173 1463.1518 1464.7988 1468.9783 1472.0602 1473.2188 1477.6857 1478.0950 1481.6463 1483.7156 1487.9940 1554.2455 1565.7208 1593.2405 1607.6800 1612.0566 1654.9204 2955.0194 2959.3807 2966.5677 2969.3164 2973.3905 2985.6164 2992.5711 2998.1079 3008.9841 3012.9353 3016.6149 3031.1224 3050.9672 3069.9231 3072.9870 3093.6174 3094.1839 3101.8351 3144.9634 3150.5160 3157.5566 3160.2972 3169.1312 3172.3337 3178.1929 3215.0571
redmass: 4.1464 4.5709 5.0609 3.8200 1.9495 3.9929 5.0772 5.3721 3.2681 4.4425 2.3268 3.2283 2.0924 3.0220 2.7338 4.2329 4.2465 4.1549 5.0469 1.3492 7.9384 1.1203 3.5364 5.3261 4.2785 5.7581 5.0438 5.3195 3.9706 4.6052 3.7505 2.9823 3.4920 3.1963 6.4259 3.1233 5.6713 5.5750 2.6306 2.1816 5.9715 6.1257 7.0933 5.6232 4.4021 1.4937 2.3217 3.5844 1.9448 1.8170 2.8938 1.2694 1.5484 5.9313 1.2633 1.2839 1.5335 3.1563 1.5830 1.4710 2.2382 7.0283 4.4264 1.2838 1.3298 1.3427 1.3570 2.6990 2.5981 1.3572 3.6287 3.7733 1.5693 2.4567 2.2536 1.6622 2.2975 2.7345 1.3411 1.2868 2.3005 2.0585 1.7963 1.8460 2.2364 1.7559 1.6590 2.6705 1.2777 3.6849 1.3453 1.1854 1.2432 1.1780 1.1029 1.3206 1.1004 1.3229 1.3501 2.0643 6.2463 1.4947 1.6267 5.4357 7.1378 1.2158 1.2113 4.2246 4.1101 1.1185 1.0930 1.0659 1.0771 1.0390 2.4162 1.0738 1.0421 1.0529 1.0806 2.4766 1.0881 7.4137 7.3632 7.9520 6.7503 6.5983 10.7996 1.0589 1.0589 1.0601 1.0591 1.0364 1.0600 1.0974 1.0364 1.1012 1.0979 1.0590 1.1037 1.1038 1.1008 1.0993 1.1041 1.1003 1.0998 1.0881 1.0880 1.0885 1.0910 1.0960 1.0962 1.0969 1.0947
irintensity: 0.6734 0.1726 1.8742 0.5770 0.2522 1.1218 0.0981 0.2346 0.4527 2.4388 1.0587 0.0903 0.1344 0.1101 0.0184 0.2544 1.3693 1.2272 0.1230 0.0870 2.5976 0.0275 1.6353 1.8889 6.7628 2.0505 6.7744 4.9596 1.7204 0.1323 0.9027 0.0319 0.0156 0.8014 23.7200 0.1338 19.7837 1.4593 11.9637 24.2928 8.1436 21.1466 6.2474 16.6491 29.1367 4.5175 10.4721 0.1228 0.3899 4.3751 13.3692 2.7206 27.6096 1.8623 1.2243 0.0668 39.0887 151.3581 87.4539 4.1738 32.8114 1.3839 105.1523 25.9124 0.1652 0.4006 1.6162 17.5332 4.1523 0.0525 26.9328 34.5738 23.6350 308.4619 290.0499 1.8051 13.7667 1.2392 16.4699 27.5647 73.8772 411.0828 265.9281 261.5240 0.8948 62.2491 66.7159 360.3620 14.1485 61.8504 33.8037 0.6590 33.7735 2.6837 3.6964 1.8391 15.8529 0.6481 3.7153 102.6359 28.6089 2.9792 1.6252 10.5385 56.5679 10.9533 29.4489 29.4033 9.1295 19.3391 7.4778 0.2752 0.7903 11.9190 99.1316 2.0435 12.7019 18.2282 4.3430 2.3395 26.4710 93.0972 90.8399 132.4281 104.9968 22.7887 219.6590 0.3878 10.8989 48.1540 86.5192 35.9596 35.0681 0.6340 39.5004 0.5895 9.9736 21.0448 27.7095 46.6727 89.7866 56.6443 36.5821 28.4834 30.4562 13.6236 0.4284 4.2669 2.5179 9.0138 2.9657 7.8582 1.6967
temp: 298.150 k
press: 1.00000 atm
elementType: 8 8 8 7 7 6 6 6 6 6 6 6 6 6 6 6 6 6 6 6 6 6 6 6 6 6 6 1 1 1 1 1 1 1 1 1 1 1 1 1 1 1 1 1 1 1 1 1 1 1 1 1 1
symmnumber: 1
zpe: 1131246.8 jmol-1
zpe.correction: 0.430869 hartree
zpe.thermalcorrener: 0.458804 hartree
zpe.thermalcorrenthalpy: 0.459749 hartree
zpe.thermalcorrgfe: 0.365573 hartree
zpe.sumelectzpe: -1187.101612 hartree
zpe.sumelectthermal: -1187.073677 hartree
zpe.sumelectthermalent: -1187.072733 hartree
zpe.sumelectthermalfe: -1187.166908 hartree
dipole: -4.1602 -0.5978 0.5684
dipole: 4.2412
quadrupole: -154.6828 -166.3564 -158.5233
quadrupole: -25.7098 17.5188 -2.6547
quadrupole: 5.1714 -6.5022 1.3308 -25.7098 17.5188 -2.6547
hfenergy: -1187.5324814 hartree
pointgroup: C01 [X(C22H26N2O3)]
dipole: -1.6376373 -0.2079757 0.2432116 debye
polarizability: 646.4031524|67.6767209|214.5551451|11.1283255|-45.5332492|190.8755948 unknown
InChI: InChI=1S/C22H26N2O3/c1-3-5-6-7-8-22(26)27-20-15-13-19(14-16-20)24-23-18-11-9-17(10-12-18)21(25)4-2/h9-16H,3-8H2,1-2H3
charge 0 multiplicity 1
53 atoms
O  -3.937845 -1.189029 -0.547095
O  -4.57154 -2.883743 0.969979
O  8.556001 1.633372 -0.610299
N  1.650344 -0.738966 0.21351
N  2.277838 0.129369 -0.542551
C  -8.208729 -0.010876 -0.244677
C  -8.725453 1.322111 0.341678
C  -6.7795 -0.354596 0.230926
C  -10.153664 1.681697 -0.129481
C  -6.266815 -1.69139 -0.379201
C  -10.659318 3.017697 0.456037
C  -4.8759 -2.033979 0.11063
C  -2.539599 -1.152965 -0.295262
C  6.487996 0.571543 0.014394
C  -1.855722 -0.214217 -1.11271
C  -1.846751 -1.937838 0.659642
C  8.750724 0.006715 1.196708
C  7.97083 0.79942 0.142313
C  0.244789 -0.822509 -0.021779
C  -0.472219 -0.046482 -0.980735
C  -0.454367 -1.758462 0.783636
C  5.778582 -0.357704 0.830553
C  5.771197 1.318389 -0.960585
C  3.686046 0.216651 -0.297551
C  4.394675 -0.538118 0.681286
C  4.386329 1.144718 -1.115632
C  10.249604 0.348797 1.227164
H  -8.225011 0.044463 -1.35314
H  -8.901153 -0.830291 0.039389
H  -8.709607 1.2680 1.450154
H  -8.031554 2.141449 0.060089
H  -6.764451 -0.427019 1.336338
H  -6.085567 0.460115 -0.051208
H  -10.170116 1.732061 -1.23741
H  -10.848059 0.865022 0.155307
H  -6.936801 -2.519688 -0.09179
H  -6.255875 -1.605541 -1.480883
H  -10.001368 3.855694 0.157865
H  -11.682125 3.250904 0.107607
H  -10.678316 2.98411 1.561719
H  -2.435447 0.366511 -1.836449
H  -2.378232 -2.659882 1.278851
H  8.603176 -1.075475 1.000176
H  8.289338 0.194285 2.188208
H  0.076904 0.670979 -1.596956
H  0.11781 -2.343197 1.511073
H  6.312291 -0.942415 1.587105
H  6.330545 2.027461 -1.579234
H  3.838243 -1.2470 1.301291
H  3.817019 1.711401 -1.859348
H  10.720224 0.146975 0.249964
H  10.405117 1.419126 1.445167
H  10.767581 -0.247856 1.999119
