program: Gaussian 09
title: 000144764
version: EM64L-G09RevD.01
frameworkgroup: C1[X(C24H30N2O3)]
method: RPBEPBE
basis: SDD
operation: Freq
keyword: #p
keyword: freq=noraman
keyword: PBEPBE/SDD
title: #p freq=noraman PBEPBE/SDD
converged: YES YES NO NO
title: Mulliken charges:
elementType: O O O N N C C C C C C C C C C C C C C C C C C C C C C C C H H H H H H H H H H H H H H H H H H H H H H H H H H H H H H
charge: -0.290579 -0.209482 -0.220139 -0.105256 -0.111512 -0.409007 -0.377882 -0.374005 -0.358950 -0.381416 -0.350687 -0.511276 -0.698092 0.221301 0.376933 -0.302776 -0.382726 -0.334385 -0.267257 0.160836 0.305289 -0.481811 0.126155 0.163653 -0.327148 -0.338410 -0.310984 -0.352301 -0.684483 0.200845 0.194187 0.195091 0.190208 0.195183 0.215993 0.204153 0.190620 0.232665 0.211426 0.189165 0.192873 0.231874 0.239844 0.218929 0.214614 0.210706 0.307894 0.257002 0.255143 0.282242 0.233302 0.232356 0.245928 0.281104 0.276014 0.254860 0.230825 0.231550 0.209798
chargesum: 0.00000
title: Mulliken charges with hydrogens summed into heavy atoms:
elementType: O O O N N C C C C C C C C C C C C C C C C C C C C C C C C
charge: -0.290579 -0.209482 -0.220139 -0.105256 -0.111512 -0.013975 0.007417 0.037171 0.035824 0.062675 0.031351 -0.039557 -0.053842 0.221301 0.376933 0.005117 -0.125725 -0.079243 0.014985 0.160836 0.305289 -0.016153 0.126155 0.163653 -0.081220 -0.057306 -0.034970 -0.097441 -0.012309
polarizability: 6.49495858e+02 7.26052992e+01 2.43049627e+02 -1.17654435e+01 4.30283730e+01 2.03242635e+02
1716.lowfreq: -4.6587 -0.0018 -0.0012 0.0010 2.6127 3.3605 7.3643 11.7229 18.1996
frequency: 6.0521 11.4409 17.9489 24.8123 27.1156 32.8115 37.5873 43.5760 52.7729 62.9097 70.6927 81.7229 96.4036 108.8163 111.4592 142.6239 148.3238 154.7776 157.5536 190.1994 191.7476 201.3572 216.9420 237.1169 249.3558 257.8744 287.8961 292.8997 311.8562 329.9063 349.2511 383.3639 386.4638 392.3450 408.6748 420.1011 433.0586 453.4551 487.6712 496.8499 516.1847 523.7423 538.5820 578.2995 594.9504 618.3033 626.2593 635.8089 665.8437 713.4885 721.4960 729.9416 737.4427 746.3731 747.0006 788.9145 805.0045 815.2120 820.1831 831.1527 842.4940 852.3197 865.4636 868.8518 881.4603 895.0762 898.8079 899.6634 941.4778 948.2986 967.5577 986.2734 993.0166 993.3073 997.3207 1001.5178 1006.9199 1014.2018 1017.8197 1027.9585 1048.6227 1068.0015 1070.6022 1085.5829 1091.0147 1102.7053 1108.3992 1114.3467 1116.2351 1132.1340 1143.7189 1150.5305 1169.1470 1183.5399 1191.8229 1199.3315 1216.2952 1219.3371 1240.4407 1244.9085 1250.4141 1266.0722 1280.2265 1288.6245 1288.8066 1293.7956 1294.8955 1314.0760 1321.5041 1332.5477 1335.6642 1346.4710 1347.7007 1357.3423 1366.3421 1375.7200 1386.4613 1389.8405 1396.3126 1418.9346 1427.1724 1435.9834 1445.4696 1461.5065 1463.0553 1467.1649 1468.1601 1469.2534 1470.8889 1476.4230 1477.4566 1477.4851 1480.9237 1482.5820 1488.5267 1554.4935 1565.4632 1593.3749 1607.2466 1611.8358 1653.1995 2954.3723 2957.9850 2962.5563 2967.0268 2968.2687 2970.3530 2973.6924 2988.0807 2992.2842 2998.2019 3003.4115 3005.4563 3013.1221 3013.6257 3025.6058 3035.6568 3059.1635 3065.6419 3070.8095 3083.9098 3094.3967 3102.1889 3143.5453 3150.2150 3155.1310 3160.0928 3168.7042 3171.6875 3176.2807 3215.4124
redmass: 4.1581 4.1977 4.2871 3.7628 4.9435 4.2206 4.3526 4.4482 6.6291 1.6944 4.2992 2.1030 3.2761 3.8188 3.7247 4.4555 3.3554 3.5504 3.9989 2.2130 1.3687 3.9295 6.5848 1.1530 2.3845 3.4582 2.7729 4.1817 5.6980 4.7054 3.9779 4.2097 2.8528 3.6391 2.9493 3.3370 3.6574 6.2588 3.0707 3.2037 4.1071 5.8163 2.6232 2.1781 5.6667 5.1388 5.6160 4.5291 3.7164 1.2744 3.1693 3.5886 1.2310 3.5155 4.4492 1.4465 1.5562 2.1433 3.4953 2.1705 1.2737 1.2978 3.2138 1.5183 1.5662 1.7253 2.1648 6.6247 1.4503 4.4184 2.1263 1.3286 1.3514 1.3589 2.6514 2.5921 1.3570 1.7561 1.5669 2.2726 2.0456 1.6716 2.4700 1.8024 2.7184 1.3401 1.2839 2.1618 2.0623 2.0663 2.2025 1.6682 1.9388 1.5469 1.7171 1.6946 1.4745 2.5105 3.7761 1.1870 1.3288 1.2615 1.2368 1.2018 1.1716 1.1537 1.3220 1.2283 1.3047 2.0592 1.4089 7.5902 1.4867 1.5146 1.5080 5.5843 7.2489 1.2183 1.2107 4.2158 4.0876 1.1183 1.0876 1.0790 1.0725 1.0933 1.0393 1.1050 2.2163 1.0883 1.0502 1.0474 1.0727 2.4765 1.0863 7.4761 7.4273 8.0175 6.7882 6.6243 10.9120 1.0590 1.0591 1.0601 1.0601 1.0602 1.0365 1.0620 1.0649 1.0946 1.0363 1.0642 1.0983 1.0979 1.0995 1.1000 1.1035 1.1013 1.1005 1.0994 1.0991 1.1003 1.0999 1.0882 1.0880 1.0884 1.0912 1.0959 1.0963 1.0967 1.0947
irintensity: 0.2297 1.0005 0.1079 0.2997 2.2879 0.0355 1.1279 0.0952 0.1897 0.0646 2.9261 0.4120 0.1015 0.2056 0.0586 0.5528 0.3114 0.0697 2.2718 0.3474 0.0323 0.2082 2.1733 0.0885 0.2719 1.6138 4.6311 4.1604 2.1729 9.5217 1.8938 1.1678 0.0398 0.3779 0.0718 0.6356 1.3719 21.1249 0.0114 4.2700 15.7550 6.7198 11.9612 24.7313 10.7341 14.1226 1.0021 10.1106 12.8133 15.5241 7.7473 0.0754 7.7089 14.0580 5.6335 6.0393 26.3625 1.0895 2.0624 4.1142 4.0723 0.1814 71.7406 40.1533 91.8259 5.8737 37.3902 2.3654 1.0543 114.1506 166.6127 0.1714 1.0406 1.0758 21.0917 4.0128 0.0469 25.6617 25.7575 207.6776 0.3793 1.8187 98.6016 207.2586 1.3096 25.7515 27.0070 2.0743 5.5310 431.0485 187.6159 19.0441 142.0628 25.9892 69.5529 74.4277 136.5618 261.8446 41.0001 0.2889 3.7633 3.2143 3.5212 0.2263 2.3629 11.1243 0.1278 7.8472 0.4901 103.3491 1.7118 28.5200 0.7259 2.6698 0.6729 8.2134 55.1357 7.8027 29.2839 30.1199 6.8921 18.9611 15.5712 6.1889 2.7251 21.3306 11.9328 4.7786 78.7881 18.4002 11.2899 17.7597 0.6561 1.6774 10.6355 90.7014 90.4884 130.4611 98.5357 19.6561 214.0019 2.6616 21.5234 8.1087 49.2441 116.1694 34.3821 18.9250 43.8235 2.0539 39.4551 22.2849 7.8054 9.9071 17.1491 73.2478 108.1266 43.4665 100.8982 45.6316 49.2559 27.8861 30.3467 13.8710 0.4463 5.0435 2.8313 9.2084 2.5039 8.8847 1.8180
temp: 298.150 k
press: 1.00000 atm
elementType: 8 8 8 7 7 6 6 6 6 6 6 6 6 6 6 6 6 6 6 6 6 6 6 6 6 6 6 6 6 1 1 1 1 1 1 1 1 1 1 1 1 1 1 1 1 1 1 1 1 1 1 1 1 1 1 1 1 1 1
symmnumber: 1
zpe: 1278776.8 jmol-1
zpe.correction: 0.487060 hartree
zpe.thermalcorrener: 0.517383 hartree
zpe.thermalcorrenthalpy: 0.518328 hartree
zpe.thermalcorrgfe: 0.418299 hartree
zpe.sumelectzpe: -1265.545685 hartree
zpe.sumelectthermal: -1265.515362 hartree
zpe.sumelectthermalent: -1265.514417 hartree
zpe.sumelectthermalfe: -1265.614446 hartree
dipole: -3.7764 -0.6718 -0.4493
dipole: 3.8619
quadrupole: -170.1614 -178.5290 -170.6031
quadrupole: -20.9741 -21.8064 0.1109
quadrupole: 2.9364 -5.4311 2.4947 -20.9741 -21.8064 0.1109
hfenergy: -1266.0327449 hartree
pointgroup: C01 [X(C24H30N2O3)]
dipole: 1.4465074 -0.4495062 0.1187316 debye
polarizability: 635.2917843|-99.5781358|281.5548063|-24.5527744|-20.2760087|178.9415293 unknown
InChI: InChI=1S/C24H30N2O3/c1-3-5-6-7-8-9-10-24(28)29-22-17-15-21(16-18-22)26-25-20-13-11-19(12-14-20)23(27)4-2/h11-18H,3-10H2,1-2H3
charge 0 multiplicity 1
59 atoms
O  4.105726 -1.169612 -1.278891
O  4.523816 -3.314672 -0.392967
O  -8.110921 2.632578 -0.620363
N  -1.456593 -0.480427 -0.510231
N  -1.970455 0.657292 -0.910874
C  7.475886 0.680726 1.445442
C  6.72723 1.983756 1.063285
C  6.898888 -0.618414 0.828678
C  5.230384 2.00073 1.451561
C  6.901377 -0.625429 -0.716378
C  4.547386 3.356286 1.157258
C  6.370706 -1.953599 -1.319825
C  3.045368 3.364166 1.515646
C  4.938506 -2.268403 -0.927626
C  2.706564 -1.084561 -1.044637
C  1.90007 -2.089973 -0.455956
C  2.150486 0.152055 -1.468361
C  0.523133 -1.831941 -0.302263
C  0.780854 0.395598 -1.310567
C  -0.050351 -0.6040 -0.722489
C  -6.167269 1.233081 -0.378075
C  -8.542318 0.455621 0.391872
C  -7.637456 1.523992 -0.231592
C  -3.381813 0.774253 -0.6972
C  -5.580236 0.005989 0.048877
C  -5.33662 2.225745 -0.96695
C  -4.204875 -0.226986 -0.105625
C  -3.959545 2.000503 -1.125581
C  -10.014432 0.889356 0.487926
H  7.470282 0.577824 2.549865
H  8.540366 0.777625 1.146495
H  6.821883 2.170645 -0.026153
H  7.234178 2.836278 1.560767
H  7.489329 -1.48273 1.195784
H  5.865248 -0.774897 1.197006
H  4.686746 1.202061 0.906551
H  5.127412 1.7658 2.531939
H  6.288023 0.207649 -1.10336
H  7.93428 -0.467696 -1.085393
H  4.674365 3.601603 0.08247
H  5.069376 4.156834 1.720536
H  6.985946 -2.80985 -0.993793
H  6.417058 -1.898324 -2.425012
H  2.495726 2.595506 0.939296
H  2.581251 4.344634 1.301797
H  2.894039 3.145693 2.589693
H  2.335993 -3.034458 -0.131963
H  2.815416 0.896492 -1.916934
H  -0.135379 -2.582249 0.147029
H  0.328313 1.338609 -1.630041
H  -8.449441 -0.473413 -0.207917
H  -8.145417 0.201682 1.396458
H  -6.203446 -0.770395 0.50457
H  -5.803319 3.162021 -1.289301
H  -3.74138 -1.163619 0.217457
H  -3.303627 2.751789 -1.576912
H  -10.117471 1.800148 1.101983
H  -10.421509 1.12533 -0.509936
H  -10.626135 0.087795 0.939022
