program: Gaussian 09
title: 000144754
version: EM64L-G09RevD.01
frameworkgroup: C1[X(C15H14N2O2)]
method: RPBEPBE
basis: SDD
operation: Freq
keyword: #p
keyword: freq=noraman
keyword: PBEPBE/SDD
title: #p freq=noraman PBEPBE/SDD
converged: YES YES NO NO
title: Mulliken charges:
elementType: O O N N C C C C C C C C C C C C C C C H H H H H H H H H H H H H H
charge: -0.219398 -0.218472 -0.065664 0.015513 0.371265 0.119265 0.452267 -0.542540 0.399062 -0.317701 0.447228 -0.517833 -0.388594 -0.801862 -0.394719 -0.382666 -0.384259 -0.220962 -0.807262 0.291163 0.254530 0.273872 0.285924 0.226791 0.238740 0.250724 0.232749 0.233511 0.237760 0.232700 0.232850 0.225846 0.240171
chargesum: 0.00000
title: Mulliken charges with hydrogens summed into heavy atoms:
elementType: O O N N C C C C C C C C C C C C C C C
charge: -0.219398 -0.218472 -0.065664 0.015513 0.371265 0.119265 0.452267 -0.251377 0.399062 -0.063171 0.447228 -0.243961 -0.102670 -0.085606 -0.161970 -0.149155 -0.146499 0.011738 -0.108396
polarizability: 4.14337366e+02 -6.40048994e+00 1.79556615e+02 -4.77865330e+00 8.22122956e-01 1.00027202e+02
1716.lowfreq: -15.5631 -0.0005 0.0004 0.0007 3.2938 6.0726 7.8546 26.5278 36.9164
frequency: -15.3125 26.4812 36.8730 44.7089 65.2006 99.8337 111.4648 124.9803 169.6438 193.6555 203.6008 206.0648 244.6701 275.1878 320.9367 339.1741 373.4368 418.6548 435.8359 444.7910 460.5980 515.1727 526.5401 530.0585 552.9580 577.8544 595.5946 651.6020 686.7377 701.3281 733.8738 741.7181 750.7130 793.6348 799.7677 838.9603 907.0059 909.6686 926.2357 934.2909 940.5065 975.1968 984.8920 988.1656 993.6039 996.4791 1011.7741 1049.9146 1051.5291 1084.3056 1099.4383 1124.6278 1155.6685 1182.1615 1191.5657 1211.6896 1218.4055 1265.2853 1268.8188 1299.5635 1352.5860 1367.6332 1388.3189 1395.1298 1400.3291 1401.8961 1417.1051 1436.3962 1453.7561 1466.9977 1474.0406 1475.2508 1478.6765 1486.6586 1574.5799 1589.9331 1592.8270 1612.2315 1626.7590 2954.5224 2979.4589 2983.6725 3061.1012 3061.7407 3089.7118 3098.2422 3120.8471 3128.8811 3142.0642 3144.2532 3158.0139 3170.6266 3183.3305
redmass: 1.0143 4.2350 6.3422 5.4373 8.2368 5.5457 1.0604 4.5829 5.9697 3.2246 3.5033 4.4889 4.5918 2.8139 3.6514 4.3442 4.9829 5.7304 3.5348 3.4013 3.4568 4.9563 3.9411 6.0586 3.9918 4.3918 6.1739 7.6690 5.0166 2.0291 4.9608 6.5666 5.2708 2.6803 1.8828 1.5622 1.3530 5.1534 1.3699 1.4127 2.1731 1.3455 1.5172 5.6498 1.4928 1.5517 1.6091 1.5530 1.5818 1.8731 1.6550 1.9103 1.7940 1.1025 2.3653 7.0532 3.1105 1.5680 1.7397 1.4401 8.5384 2.2083 5.6449 3.1614 1.2681 1.3563 2.9121 2.3208 1.0757 2.2653 1.2854 1.2742 1.1826 2.0783 8.0351 6.8322 5.9392 6.2449 6.8594 1.0869 1.0386 1.0374 1.0958 1.0953 1.1000 1.1003 1.0868 1.0917 1.0918 1.0898 1.0989 1.0920 1.0952
irintensity: 0.8252 0.3943 0.4055 0.3245 0.0121 1.4251 0.9689 2.1092 5.0726 3.1875 5.7921 0.7200 5.0368 9.5219 2.2753 2.4531 0.6280 1.8511 13.8495 3.9725 4.4091 1.6461 0.0668 0.0320 3.9038 1.0169 10.1093 24.2658 12.0803 39.6179 5.6801 10.7152 18.6426 33.8071 34.8067 37.4535 3.6916 20.8913 17.3345 3.4474 12.2004 3.9309 28.4491 1.5743 24.8506 1.2297 0.1672 11.8818 19.4803 71.6149 15.0443 82.2574 63.3174 9.0009 7.9803 610.7162 128.2752 47.6589 3.6355 15.6418 100.9361 6.8827 6.0323 2.3254 14.1690 26.7150 18.4646 25.5711 18.2628 8.5392 14.0460 25.3163 7.8946 47.7208 153.8149 188.4243 142.4463 3.1273 88.0308 37.1841 28.8980 17.1041 12.5800 20.3813 15.3930 19.7634 0.3583 18.4553 4.1704 5.6628 34.3792 1.0009 1.6262
temp: 298.150 k
press: 1.00000 atm
elementType: 8 8 7 7 6 6 6 6 6 6 6 6 6 6 6 6 6 6 6 1 1 1 1 1 1 1 1 1 1 1 1 1 1
symmnumber: 1
zpe: 667699.7 jmol-1
zpe.correction: 0.254313 hartree
zpe.thermalcorrener: 0.270977 hartree
zpe.thermalcorrenthalpy: 0.271921 hartree
zpe.thermalcorrgfe: 0.208229 hartree
zpe.sumelectzpe: -838.526610 hartree
zpe.sumelectthermal: -838.509946 hartree
zpe.sumelectthermalent: -838.509002 hartree
zpe.sumelectthermalfe: -838.572694 hartree
dipole: 8.7715 -0.1329 -0.8007
dipole: 8.8090
quadrupole: -138.0476 -101.4244 -111.5044
quadrupole: -3.3033 2.6078 2.5113
quadrupole: -21.0555 15.5677 5.4877 -3.3033 2.6078 2.5113
hfenergy: -838.7809231 hartree
pointgroup: C01 [X(C15H14N2O2)]
dipole: -3.4507197 0.0123065 0.3220188 debye
polarizability: 414.1659785|7.3635581|170.6366025|-6.9518587|-25.3786274|109.1186018 unknown
InChI: InChI=1S/C15H14N2O2/c1-11-4-3-5-13(8-11)10-16-15-7-6-14(17(18)19)9-12(15)2/h3-10H,1-2H3
charge 0 multiplicity 1
33 atoms
O  5.754219 -1.403422 -0.159936
O  5.898947 0.872977 -0.063547
N  -0.457128 0.184543 -0.060089
N  5.216748 -0.226796 -0.099907
C  1.735075 1.258927 0.015463
C  0.944187 0.059037 -0.010754
C  -2.728337 -0.530669 0.485274
C  3.136895 1.140916 -0.010055
C  3.745509 -0.135123 -0.068196
C  1.582628 -1.216282 -0.081376
C  -4.752688 0.345365 -0.623928
C  -3.348687 0.316637 -0.474088
C  2.981381 -1.322151 -0.109834
C  1.056692 2.609587 0.08809
C  -1.266761 -0.571101 0.640741
C  -3.533238 -1.3666 1.306711
C  -5.538399 -0.503096 0.20589
C  -4.935464 -1.35011 1.16334
C  -5.412057 1.27369 -1.629077
H  3.77508 2.028749 0.012023
H  0.96499 -2.118133 -0.151606
H  -2.704731 0.947808 -1.09692
H  3.489213 -2.288173 -0.1682
H  1.77721 3.429361 -0.068739
H  0.571573 2.762364 1.070557
H  0.254535 2.679495 -0.668555
H  -0.879965 -1.27255 1.410656
H  -3.059291 -2.02351 2.046748
H  -6.629877 -0.49796 0.097393
H  -5.559367 -1.995759 1.79065
H  -4.779157 1.418258 -2.521896
H  -6.390183 0.884184 -1.961213
H  -5.58835 2.273338 -1.18682
