program: Gaussian 09
title: 000144752
version: EM64L-G09RevD.01
frameworkgroup: C1[X(C12H8BrNO)]
method: RPBEPBE
basis: SDD
operation: Freq
keyword: #p
keyword: freq=noraman
keyword: PBEPBE/SDD
title: #p freq=noraman PBEPBE/SDD
converged: YES YES NO NO
title: Mulliken charges:
elementType: Br O N C C C C C C C C C C C C H H H H H H H H
charge: 0.009231 -0.196509 0.000468 0.461247 0.010392 0.041242 -0.351936 -0.351346 -0.201856 -0.230366 -0.247083 -0.220886 -0.196342 -0.158362 -0.359664 0.263433 0.275273 0.251516 0.236879 0.237620 0.245296 0.235498 0.246258
chargesum: 0.00000
title: Mulliken charges with hydrogens summed into heavy atoms:
elementType: Br O N C C C C C C C C C C C C
charge: 0.009231 -0.196509 0.000468 0.461247 0.010392 0.041242 -0.351936 -0.087913 0.049660 0.006513 0.028190 0.016733 0.048954 0.077136 -0.113407
polarizability: 2.02446202e+02 2.06602575e+01 1.38007024e+02 -1.70457359e+01 1.22979097e+01 1.10348588e+02
1716.lowfreq: -8.2858 -4.0925 -1.7318 -0.0008 -0.0006 0.0003 32.2009 46.5660 70.0375
frequency: 32.1981 46.5401 70.0353 102.9761 128.5371 157.0734 220.1873 240.9126 275.0255 331.1143 369.0188 402.4707 432.3974 441.2785 473.6389 574.0699 608.8395 630.5074 658.9882 691.3424 727.1778 741.4778 747.6503 770.2481 820.1541 872.8255 912.1791 921.7826 955.9585 964.0439 970.3487 989.9145 1006.5808 1010.6603 1034.3943 1045.3632 1086.4750 1118.1607 1161.6172 1170.2610 1174.7551 1254.5734 1281.0333 1294.3177 1326.2615 1365.3037 1411.0171 1416.7502 1444.0033 1452.4333 1551.3699 1562.2536 1566.8331 1577.9087 1595.9335 3133.5414 3138.3693 3146.7008 3150.0855 3164.1143 3165.3736 3175.7483 3177.2667
redmass: 7.7075 5.3696 5.1819 7.5841 6.3169 6.4266 5.6188 7.2708 6.2118 7.6088 5.9401 3.5424 3.9346 4.2231 4.5066 5.1420 7.4342 6.4864 6.0164 4.6599 5.5962 2.5117 1.6259 1.5751 2.7376 1.4377 1.3664 5.0287 1.4264 6.7488 1.4670 1.3463 6.6160 1.3916 2.4530 2.0743 1.6082 1.7351 1.1967 2.1646 1.0880 1.5855 1.6116 3.1501 6.3937 8.6419 1.9775 2.1714 2.1782 2.5085 7.9684 6.1070 6.1801 6.8272 6.8649 1.0881 1.0857 1.0903 1.0905 1.0952 1.0953 1.1004 1.1005
irintensity: 5.0202 1.2877 1.5566 2.9276 1.5289 0.7681 3.5901 0.9262 1.9121 3.4508 7.4240 4.2669 2.5192 1.3383 12.7703 3.7885 8.6375 16.7422 36.8508 7.2504 3.6125 32.0320 53.9615 48.3232 23.0196 1.0113 2.3795 43.6924 1.7807 9.3118 0.7454 0.5126 53.5924 3.8459 2.2236 2.3926 9.6766 2.2013 0.2292 6.3361 1.5388 14.6723 13.5526 178.2117 19.2731 2.2087 8.5622 57.4666 5.1994 10.5642 113.4316 4.3700 27.0934 30.3326 33.1483 7.0636 1.1896 12.1376 5.1471 10.5995 15.9422 20.5747 14.1875
temp: 298.150 k
press: 1.00000 atm
elementType: 35 8 7 6 6 6 6 6 6 6 6 6 6 6 6 1 1 1 1 1 1 1 1
symmnumber: 1
zpe: 433289.6 jmol-1
zpe.correction: 0.165031 hartree
zpe.thermalcorrener: 0.177563 hartree
zpe.thermalcorrenthalpy: 0.178507 hartree
zpe.thermalcorrgfe: 0.123876 hartree
zpe.sumelectzpe: -604.465924 hartree
zpe.sumelectthermal: -604.453393 hartree
zpe.sumelectthermalent: -604.452449 hartree
zpe.sumelectthermalfe: -604.507080 hartree
dipole: 1.3229 0.6164 2.0421
dipole: 2.5100
quadrupole: -67.2704 -96.6012 -98.0481
quadrupole: 3.6149 -2.9307 -2.3133
quadrupole: 20.0361 -9.2946 -10.7415 3.6149 -2.9307 -2.3133
hfenergy: -604.6309557 hartree
pointgroup: C01 [X(C12H8Br1N1O1)]
dipole: 0.5314979 -0.6810194 0.4784125 debye
dipolederiv: -0.2056351 -0.1720352 -0.2280556 -0.1462787 -0.2006873 -0.2337338 -0.1295799 -0.2395959 -0.373844 -0.776269 0.0216217 0.0466631 0.1072799 -0.4581148 0.2780165 0.0600916 0.2857022 -0.7537153 -0.3299711 0.0315536 -0.036075 -0.0187214 -0.2893758 0.0201017 0.1199342 0.0407052 -0.1654116 -0.5757965 -0.1967167 0.0340656 -0.2912444 -0.1232476 -0.0538019 0.0582131 -0.0640171 -0.2786595 1.8342508 -0.0430488 -0.0777976 -0.0078525 0.3879634 -0.4070568 -0.0064364 -0.3587406 0.7633318 -0.2383547 0.0179937 -0.0665562 0.0688511 0.0566422 0.0832382 -0.2021938 0.0259699 -0.0710191 0.3388812 0.3804066 0.4350562 0.3813074 0.2931262 0.4397835 0.0804318 0.4115133 0.6287804 0.1048686 0.0884441 -0.0467584 0.030008 -0.0759681 0.0376119 0.1259039 0.0504395 0.0238271 -0.2771639 -0.1353516 -0.1609386 -0.1345964 -0.1963538 -0.0915867 -0.183967 -0.0971048 -0.0802728 -0.0899016 0.071236 0.1243697 0.0689074 -0.0979819 0.0782938 0.0911418 0.0541585 -0.056178 -0.2124687 -0.0178894 -0.002706 0.0412498 0.0021847 -0.0594972 -0.0896629 -0.0557232 -0.0311816 0.0740917 0.082136 -0.0707824 0.1123394 -0.068782 0.0424068 0.0213144 0.0783385 0.0869206 0.1920779 0.1137066 0.0014319 0.0940426 -0.0097303 -0.0666666 0.0202426 -0.0594218 -0.070251 0.0521363 -0.1222816 0.1511735 0.0328765 -0.1320392 0.0312337 0.0046463 0.0008434 -0.0728605 -0.1247544 0.1198557 -0.0815276 -0.1082712 0.2357204 -0.2247235 0.0609892 -0.2062415 0.0855555 0.091407 -0.026393 0.0515457 -0.0019385 0.1286341 -0.0170916 0.0332585 -0.0454024 -0.0227869 0.1439264 0.006783 -0.0197859 -0.0089152 0.0475454 0.0717723 0.008131 0.0860866 0.0889703 0.0920545 -0.0135745 0.045089 -0.0274095 0.1317635 -0.0460255 0.070899 -0.0312048 -0.0292162 0.0102568 -0.0777959 -0.0642589 -0.0874033 0.1035186 -0.0809642 -0.0789906 -0.0765015 0.0067945 -0.0712244 -0.0907183 0.0412587 -0.090099 0.1171899 -0.0041188 0.0534392 -0.0070788 0.069061 -0.0639964 -0.078224 0.013366 -0.0897279 0.0733422 0.0337421 0.0093836 0.0355344 0.1234563 -0.0459116 0.0528401 -0.0864115 0.0486785 0.0975399 0.056297 -0.0864526 0.0571681 0.0909402 0.0774962 -0.0125483 -0.0023655 0.0269176 -0.0228897 0.1127691 -0.0407371 0.1145725 0.0377587 unknown
polarizability: 200.907553|24.8209627|106.9673182|15.3897772|-1.5303951|142.9269421 unknown
InChI: InChI=1S/C12H8BrNO/c13-10-6-2-1-5-9(10)12(15)11-7-3-4-8-14-11/h1-8H
charge 0 multiplicity 1
23 atoms
Br -0.610832 1.250916 2.091053
O  0.261471 1.17363 -2.149566
N  1.370445 -0.999198 0.466743
C  -1.152759 0.046022 -0.560229
C  0.186261 0.506858 -1.075224
C  1.44615 0.091444 -0.358411
C  -1.634551 0.226305 0.759159
C  -2.016772 -0.577863 -1.501791
C  -2.9085 -0.233128 1.149945
C  -3.287817 -1.054499 -1.125852
C  2.651788 0.79441 -0.608764
C  -3.730424 -0.890696 0.206445
C  3.828994 0.36555 0.038738
C  3.763967 -0.758181 0.895926
C  2.519131 -1.410719 1.070261
H  -1.661575 -0.683573 -2.532192
H  2.638131 1.644931 -1.29632
H  -3.259658 -0.069817 2.172783
H  -3.928492 -1.545631 -1.865209
H  -4.7163 -1.255096 0.514212
H  4.775839 0.891719 -0.120409
H  4.653513 -1.126136 1.417034
H  2.432291 -2.291649 1.71617
