program: Gaussian 09
title: 000144751
version: EM64L-G09RevD.01
frameworkgroup: C1[X(C10H14)]
method: RPBEPBE
basis: SDD
operation: Freq
keyword: #p
keyword: freq=noraman
keyword: PBEPBE/SDD
title: #p freq=noraman PBEPBE/SDD
converged: NO YES NO YES
title: Mulliken charges:
elementType: C C C C C C C C C C H H H H H H H H H H H H H H
charge: 0.140932 0.140917 0.074571 0.074582 0.376439 -0.804733 -0.804728 -0.812393 -0.812392 -0.740172 0.223703 0.226051 0.226047 0.226050 0.223702 0.226052 0.227351 0.227356 0.223869 0.227353 0.227352 0.223868 0.229112 0.229112
chargesum: 0.00000
title: Mulliken charges with hydrogens summed into heavy atoms:
elementType: C C C C C C C C C C
charge: 0.140932 0.140917 0.074571 0.074582 0.376439 -0.128933 -0.128924 -0.133816 -0.133819 -0.281948
polarizability: 1.14970173e+02 -1.80905999e-03 1.53579903e+02 -1.08972429e-04 4.07251372e-04 6.26905377e+01
1716.lowfreq: -0.0006 -0.0004 0.0003 10.8386 11.0323 11.8279 90.3717 103.0694 113.6865
frequency: 90.0573 103.0691 113.6847 121.0845 152.5928 167.6831 193.4469 259.7178 277.1511 283.3772 298.5824 315.1068 400.2326 510.3377 542.2399 559.9774 594.6474 601.9860 702.4202 727.0338 789.5784 811.7664 938.3566 951.1622 956.9642 1020.8323 1026.4313 1046.3812 1048.6354 1076.1918 1094.3890 1104.0224 1152.1000 1221.2012 1334.4045 1354.3581 1395.6303 1398.4897 1400.5053 1407.8746 1431.8943 1459.3649 1461.9768 1467.0557 1467.1256 1473.4625 1473.5329 1474.9908 1479.9867 1621.0448 1652.8197 1656.5907 2960.5642 2961.4061 2962.0956 2965.5711 3028.6230 3029.0651 3029.9354 3033.7013 3074.2376 3075.0969 3077.6960 3079.7314 3091.2596 3191.1792
redmass: 1.0619 1.2331 1.5013 1.9290 1.3641 1.1125 2.4686 2.5755 2.5292 2.4993 2.5352 2.9881 3.5384 3.6392 4.5647 2.5760 4.4899 1.9622 4.2182 1.3726 2.4201 2.2255 1.5810 1.4338 1.3983 1.4011 1.4127 1.5549 1.6434 1.9128 2.1780 1.8251 3.6000 3.9857 4.4218 2.6965 1.3413 1.7108 1.2164 1.2527 1.1989 1.0696 1.0468 1.0459 1.0453 1.0449 1.0576 1.0709 1.0988 6.8840 5.6907 7.2058 1.0381 1.0380 1.0384 1.0379 1.0973 1.0974 1.0964 1.0966 1.0968 1.0962 1.0958 1.0960 1.0615 1.1141
irintensity: 0.0000 1.0963 0.0000 0.9288 0.0000 2.5742 9.2895 0.9545 0.1320 0.0047 0.5458 0.0000 0.0102 2.5860 0.0161 0.0000 0.1750 0.0000 0.1404 0.0000 0.6813 8.8851 0.3020 9.7806 70.7951 6.5428 0.0000 0.0746 0.0000 8.4842 17.6788 2.1484 0.1797 11.6927 16.7539 0.5103 11.1084 0.1956 19.7951 10.6865 27.4905 18.3502 0.0000 0.0046 13.3138 35.2862 5.2724 19.2293 0.0007 0.4687 2.8718 5.0604 61.2688 45.8954 26.8708 45.3837 0.0001 44.4025 0.0028 56.9204 0.0035 34.8050 68.1890 0.0064 7.0520 12.9396
temp: 298.150 k
press: 1.00000 atm
elementType: 6 6 6 6 6 6 6 6 6 6 1 1 1 1 1 1 1 1 1 1 1 1 1 1
symmnumber: 1
zpe: 539657.6 jmol-1
zpe.correction: 0.205545 hartree
zpe.thermalcorrener: 0.217354 hartree
zpe.thermalcorrenthalpy: 0.218298 hartree
zpe.thermalcorrgfe: 0.168786 hartree
zpe.sumelectzpe: -388.678022 hartree
zpe.sumelectthermal: -388.666213 hartree
zpe.sumelectthermalent: -388.665268 hartree
zpe.sumelectthermalfe: -388.714781 hartree
dipole: 0.0000 -0.2623 0.0001
dipole: 0.2623
quadrupole: -57.3346 -55.9471 -64.7686
quadrupole: -0.0003 -0.0002 0.0000
quadrupole: 2.0155 3.4030 -5.4185 -0.0003 -0.0002 0.0000
hfenergy: -388.8835666 hartree
pointgroup: C01 [X(C10H14)]
dipole: -0.0000108 0.1032061 -0.0000328 debye
dipolederiv: 0.1104491 -0.5573874 0.0000034 -0.155596 0.0821771 -0.0000155 -0.0000116 -0.0000362 -0.0752398 0.1103487 0.5573639 -0.000014 0.1555833 0.0823478 -0.0000138 -0.0000181 0.0000099 -0.0752337 -0.029859 0.0002834 -0.0000047 0.0238716 0.1132825 0.0000101 0.0000417 0.0000552 -0.1370074 -0.0298554 -0.0003306 0.0000379 -0.0238921 0.1132174 -0.000001 0.0000232 0.0000163 -0.1370036 0.0094366 0.0000495 -0.0000117 0.0000183 0.0000548 0.0000049 -0.0000125 -0.0000451 0.0799348 -0.0259181 0.061978 -0.0000063 0.0672357 -0.1376622 0.0000094 0.0000001 0.000032 0.0919806 -0.0258812 -0.0619445 -0.0000009 -0.0672144 -0.1377101 0.0000178 -0.0000041 0.0000132 0.0919745 -0.0516051 -0.0066944 -0.0000017 -0.0523059 0.0438338 0.0000002 -0.0000309 -0.0000119 0.112706 -0.0516155 0.0066703 -0.0000289 0.0522838 0.0438477 0.000018 -0.0000052 0.0000136 0.1127077 0.0911413 0.0000155 -0.0000151 0.0000153 -0.1819318 0.0000217 -0.0000114 0.0000005 -0.380741 -0.1697477 0.0367429 0.0000164 -0.0739331 0.085009 0.0000096 0.0000208 -0.0000031 0.1020029 0.0942671 -0.0019392 0.0691382 0.0006278 -0.0442844 0.0922338 0.0308225 0.1425875 -0.0508769 0.0942588 -0.0019671 -0.0691509 0.0006113 -0.0443201 -0.0922448 -0.0308371 -0.1425955 -0.0508297 0.0942568 0.0019955 -0.0691782 -0.0005752 -0.0442869 0.0922147 -0.030875 0.1425731 -0.0508447 -0.1697659 -0.0368016 0.0000197 0.0738744 0.0850171 -0.0000105 0.0000142 -0.0000059 0.1020039 0.0942724 0.0019633 0.06915 -0.000601 -0.0443086 -0.0922229 0.0308502 -0.1425846 -0.0508533 0.013126 -0.0288145 0.0103384 -0.0899591 -0.009036 0.1152319 0.077021 0.1146645 -0.0567787 0.0130993 -0.0288296 -0.0103535 -0.089956 -0.0089885 -0.1152062 -0.0770435 -0.1146522 -0.0568215 -0.0441857 0.0836317 0.0000128 0.1795736 -0.0279456 -0.0000268 0.0000211 -0.0000166 0.100597 0.0130433 0.0288679 0.0104123 0.0899784 -0.0089361 -0.1151913 0.0771018 -0.1146318 -0.0568413 0.0131222 0.028793 -0.010337 0.0899475 -0.0090321 0.1152424 -0.0770239 0.1146544 -0.0567639 -0.044122 -0.0836321 -0.0000354 -0.1795766 -0.0280086 -0.0000681 -0.0000519 -0.0000451 0.1005949 -0.0541483 0.104995 0.0000075 0.063373 0.0388444 -0.0000064 0.0000058 0.000002 0.1706682 -0.0541178 -0.1050087 0.0000018 -0.0633844 0.0388196 -0.0000071 0.0000026 0.0000058 0.1706648 unknown
polarizability: 114.9701733|-0.0035939|153.5799023|0.0001089|0.0004073|62.6905377 unknown
InChI: InChI=1S/C10H14/c1-6-7(2)9(4)10(5)8(6)3/h1H2,2-5H3
charge 0 multiplicity 1
24 atoms
C  -0.753443 0.942412 -0.000107
C  0.753216 0.942571 -0.000113
C  -1.205344 -0.362335 -0.000069
C  1.205376 -0.362091 -0.00009
C  0.000128 -1.245496 -0.00008
C  -1.565964 2.210817 -0.000165
C  1.565442 2.211158 -0.000174
C  -2.621537 -0.877732 -0.000085
C  2.621695 -0.877158 0.000035
C  0.000246 -2.610817 -0.000171
H  -2.650371 2.006543 -0.000075
H  -1.341875 2.833637 -0.888584
H  -1.341772 2.833807 0.888111
H  1.341091 2.833986 -0.888517
H  2.649902 2.007137 -0.000269
H  1.341249 2.834014 0.888191
H  -2.828759 -1.503867 0.890086
H  -2.828809 -1.503663 -0.890386
H  -3.354266 -0.052368 0.000038
H  2.829264 -1.502943 -0.890304
H  2.828921 -1.503336 0.890171
H  3.354229 -0.051619 0.000357
H  0.932835 -3.187106 -0.000222
H  -0.932253 -3.18725 -0.000178
