program: Gaussian 09
title: 000144795
version: EM64L-G09RevD.01
frameworkgroup: C1[X(C14H10N4S2)]
method: RPBEPBE
basis: SDD
operation: Freq
keyword: #p
keyword: freq=noraman
keyword: PBEPBE/SDD
title: #p freq=noraman PBEPBE/SDD
converged: YES YES NO NO
title: Mulliken charges:
elementType: S S N N N N C C C C C C C C C C C C C C H H H H H H H H H H
charge: 0.562760 0.561713 -0.473374 -0.473378 -0.473277 -0.473298 0.279033 0.279033 -0.320585 -0.320607 -0.321234 -0.321238 0.166489 0.166497 -0.220285 -0.220280 -0.220118 -0.220118 -0.224590 -0.224580 0.274417 0.274424 0.274665 0.274663 0.232134 0.232136 0.232110 0.232114 0.232388 0.232386
chargesum: 0.00000
title: Mulliken charges with hydrogens summed into heavy atoms:
elementType: S S N N N N C C C C C C C C C C C C C C
charge: 0.562760 0.561713 -0.473374 -0.473378 -0.473277 -0.473298 0.279033 0.279033 -0.046168 -0.046183 -0.046569 -0.046575 0.166489 0.166497 0.011849 0.011856 0.011992 0.011996 0.007798 0.007806
polarizability: 3.97571603e+02 1.46478488e-03 2.14527091e+02 5.96819585e-03 -6.49483295e+00 1.40108162e+02
1716.lowfreq: -7.9323 -4.9059 -0.0013 -0.0010 0.0017 3.7551 6.1257 25.5092 28.7563
frequency: 5.5128 25.4104 28.6637 71.6734 82.6233 108.6422 116.7521 145.6896 153.3948 220.5956 247.7340 293.3353 293.8834 303.8588 352.7242 364.9982 373.0778 402.5124 402.6078 449.0202 472.4628 475.4492 565.0976 597.8506 614.0796 614.6456 625.3182 647.3455 658.2117 665.0550 672.0904 676.5688 697.3167 698.2285 785.0740 788.2435 843.1548 861.7298 863.5179 863.9382 951.4631 951.9476 990.2030 990.3411 995.5622 995.7136 1007.3290 1007.4511 1022.3533 1023.1788 1078.0114 1078.8873 1124.6392 1140.7887 1173.4314 1173.4506 1177.5913 1181.3016 1236.8909 1285.3850 1289.7480 1306.7590 1314.0534 1325.1061 1388.4871 1388.8752 1438.8045 1440.4821 1477.5348 1477.5807 1589.1547 1589.3784 1607.1866 1607.2175 3130.2448 3130.2688 3142.5764 3142.5930 3155.1788 3155.3418 3166.2516 3166.2695 3173.0895 3173.2216
redmass: 8.2740 3.7005 4.0296 11.9977 6.6458 7.7281 6.9837 6.0827 10.8053 6.0594 6.9401 18.5865 12.2553 9.9892 6.8657 8.7778 6.7867 2.8650 2.8449 3.9241 18.3555 4.2597 15.3715 12.0363 6.4922 6.4833 6.7922 5.8481 7.2059 6.2210 12.6284 13.3175 1.8076 1.7719 1.8643 1.9077 7.7030 8.1288 1.2452 1.2458 1.4186 1.4194 6.2725 6.2755 1.3819 1.3814 1.3322 1.3311 2.2406 2.2017 1.5602 1.5488 4.7968 4.2809 1.0553 1.0553 1.1323 1.1539 7.7829 5.6830 2.7712 6.3652 1.3632 1.9707 10.0338 10.2736 2.2743 2.3237 2.3421 2.3476 6.4031 6.4166 6.1416 6.1414 1.0854 1.0854 1.0891 1.0891 1.0933 1.0932 1.0957 1.0957 1.1005 1.1005
irintensity: 0.1157 0.0000 0.0018 0.7886 0.0425 3.4614 0.0003 3.6171 0.0001 2.4808 3.3347 0.0090 1.8823 0.9740 13.7591 25.3917 0.0002 0.2240 0.0003 11.6102 32.2391 2.5976 189.4415 0.4501 0.0018 0.0034 27.8909 26.1222 17.9710 33.4913 19.7388 0.0017 27.2464 88.6664 20.4828 61.5404 0.4421 2.9125 0.0032 0.1166 1.0278 8.5038 1.6469 0.1161 0.0081 0.0011 0.0106 0.7053 45.0217 5.4368 0.0016 24.9570 67.1987 5.2024 0.1214 0.0245 113.8471 6.6826 0.0899 542.0078 1.2154 74.7339 0.0202 13.4895 0.0004 2.5626 0.0007 36.1225 3.1442 1.2216 0.0041 1.0581 4.6317 2.2750 0.1555 0.0676 4.6757 23.5435 47.3177 8.3558 1.5754 12.7134 31.2327 7.7033
temp: 298.150 k
press: 1.00000 atm
elementType: 16 16 7 7 7 7 6 6 6 6 6 6 6 6 6 6 6 6 6 6 1 1 1 1 1 1 1 1 1 1
symmnumber: 1
zpe: 547228.2 jmol-1
zpe.correction: 0.208428 hartree
zpe.thermalcorrener: 0.225676 hartree
zpe.thermalcorrenthalpy: 0.226620 hartree
zpe.thermalcorrgfe: 0.159345 hartree
zpe.sumelectzpe: -1553.123276 hartree
zpe.sumelectthermal: -1553.106029 hartree
zpe.sumelectthermalent: -1553.105084 hartree
zpe.sumelectthermalfe: -1553.172360 hartree
dipole: -0.0012 -0.1485 -1.6162
dipole: 1.6230
quadrupole: -106.9580 -124.6323 -128.7550
quadrupole: -0.0009 -0.0109 -0.2062
quadrupole: 13.1571 -4.5172 -8.6399 -0.0009 -0.0109 -0.2062
hfenergy: -1553.3317046 hartree
pointgroup: C01 [X(C14H10N4S2)]
dipole: 0.000757 0.6384725 -0.0095098 debye
polarizability: 397.5715564|-0.110353|139.5761141|-0.0024277|1.5171672|215.0591857 unknown
InChI: InChI=1S/C14H10N4S2/c1-3-7-11(8-4-1)13-15-19-17-14(18-20-16-13)12-9-5-2-6-10-12/h1-10H
charge 0 multiplicity 1
30 atoms
S  0.000086 -1.826331 -1.54927
S  0.000199 -1.787314 1.645986
N  1.501676 -1.006478 -1.18949
N  -1.501626 -1.006743 -1.189344
N  1.50381 -0.979027 1.266141
N  -1.503482 -0.979002 1.266349
C  3.257734 0.136094 0.024748
C  -3.25637 0.138031 0.024937
C  3.862185 0.524731 1.248627
C  -3.86002 0.527887 1.248814
C  3.874364 0.476591 -1.207444
C  -3.872313 0.479737 -1.207251
C  1.965915 -0.622036 0.03345
C  -1.965959 -0.622578 0.033619
C  5.076447 1.2416 1.237331
C  -5.072946 1.247026 1.237524
C  5.08865 1.193478 -1.211965
C  -5.085263 1.198904 -1.211778
C  5.693868 1.577132 0.008708
C  -5.689729 1.583717 0.008897
H  3.372199 0.255441 2.189204
H  -3.370563 0.257663 2.189396
H  3.393488 0.171045 -2.141605
H  -3.392063 0.173242 -2.141422
H  5.540125 1.540169 2.183762
H  -5.536075 1.546468 2.183947
H  5.562016 1.454576 -2.164659
H  -5.558154 1.460883 -2.164464
H  6.636001 2.136657 0.00248
H  -6.630799 2.145035 0.002672
