program: Gaussian 09
title: 000144745
version: EM64L-G09RevD.01
frameworkgroup: C1[X(C11H18O4)]
method: RPBEPBE
basis: SDD
operation: Freq
keyword: #pfreq=noraman
keyword: PBEPBE/SDD
title: #p freq=noraman PBEPBE/SDD
converged: YES YES NO NO
title: Mulliken charges:
elementType: O O O O C C C C C C C C C C C H H H H H H H H H H H H H H H H H H
charge: -0.235228 -0.237816 -0.298570 -0.214555 0.214359 0.251330 -0.233709 -0.240213 -0.211671 -0.372401 -0.266226 -0.181337 -0.682697 -0.682120 -0.684349 0.211104 0.216062 0.218852 0.209364 0.230128 0.210242 0.284165 0.253755 0.261706 0.203709 0.235083 0.223106 0.203646 0.223922 0.235403 0.208711 0.224131 0.222114
chargesum: 0.00000
title: Mulliken charges with hydrogens summed into heavy atoms:
elementType: O O O O C C C C C C C C C C C
charge: -0.235228 -0.237816 -0.298570 -0.214555 0.214359 0.251330 0.193457 0.188003 0.228700 -0.088236 -0.012471 0.080369 -0.020800 -0.019148 -0.029393
polarizability: 1.48831822e+02 3.64827593e+00 1.25091035e+02 -1.11721887e+00 -3.71051246e-01 1.21172881e+02
1716.lowfreq: -8.8442 -4.4097 0.0003 0.0004 0.0006 10.9988 29.4543 37.9006 46.1926
frequency: 29.3240 37.7975 46.1791 52.8145 67.1399 80.5425 90.3334 94.4025 124.3765 146.2287 218.5439 232.5440 237.2865 242.4505 258.9383 306.6103 320.5139 322.7743 349.8138 376.6656 384.0671 526.2588 592.6371 599.7079 693.3295 699.1661 732.8593 805.5488 811.4606 813.4332 823.2832 833.2256 836.6706 864.4176 879.4136 886.1194 917.1532 936.3713 986.9620 999.7764 1019.4920 1028.6455 1033.3043 1045.2205 1059.1856 1108.7575 1112.9208 1120.5131 1138.1650 1138.5018 1141.8339 1142.7531 1202.3655 1242.0970 1247.7450 1254.4990 1258.2412 1353.5810 1356.8957 1363.4651 1364.7968 1393.7366 1394.8148 1395.4464 1458.7340 1459.1233 1460.2424 1476.3618 1478.6484 1479.2951 1481.6735 1491.1226 1493.0174 1497.8420 1576.8887 2969.0717 2971.3541 2987.1635 2990.7847 2993.4354 2994.1282 3024.6913 3028.2731 3051.2828 3086.2507 3090.1770 3090.8148 3097.3026 3102.4168 3102.6414 3222.7740 3248.7966 3267.9056
redmass: 2.3503 4.1248 2.5772 2.4323 3.0278 3.0624 2.0301 2.5132 2.9680 3.1703 1.9013 3.0429 1.2377 1.3096 1.7924 3.5113 3.6236 4.0348 5.2040 5.9469 4.5516 4.5641 3.6038 4.5828 5.3075 5.3361 1.2687 1.1120 1.2402 1.1301 1.5333 2.9688 2.0779 6.3583 4.3980 1.3706 3.2006 4.4833 2.2932 6.7661 2.1256 2.5849 2.9686 3.0175 4.1717 2.1421 2.2271 2.2089 1.5748 1.5308 1.5298 1.5226 1.6085 3.6443 1.1854 1.1435 1.2598 2.1894 1.3808 1.3083 1.2993 1.2621 1.2634 1.2627 1.0407 1.0408 1.0413 1.1607 1.8443 1.3081 1.1150 1.0868 1.0855 1.0874 7.0278 1.0554 1.0555 1.0480 1.0465 1.0364 1.0363 1.1068 1.1068 1.1041 1.0986 1.0990 1.0990 1.1018 1.1012 1.1011 1.0917 1.0990 1.1087
irintensity: 0.0358 0.6158 0.2763 0.0223 0.6515 1.8208 4.7864 1.4492 3.4078 4.2128 2.0282 1.6413 0.1258 1.3060 4.1751 1.4790 7.6246 9.4583 3.9876 7.4667 1.3791 0.9274 2.4619 3.0928 5.3211 2.6003 69.9178 3.9437 0.4642 11.1086 10.1775 9.5531 30.6848 32.5655 15.5299 6.9786 63.7346 205.2304 5.0902 444.6581 27.7143 135.8740 69.9123 33.5616 34.6660 4.6222 26.4477 9.0199 27.4570 20.5535 6.0114 6.7124 3.7986 79.6104 4.3796 1.2662 26.2237 1.6365 0.9294 1.8727 1.2316 17.5278 24.6051 27.1741 4.0753 15.7634 10.3980 1.7234 12.0000 9.6054 0.0799 13.7767 4.4492 1.1359 4.4048 22.0891 53.8630 37.8753 34.2550 31.3584 20.3302 21.8224 34.0397 11.0277 33.9334 34.5012 34.6236 47.2798 14.6769 58.9596 3.3695 0.1576 0.5172
temp: 298.150 k
press: 1.00000 atm
elementType: 8 8 8 8 6 6 6 6 6 6 6 6 6 6 6 1 1 1 1 1 1 1 1 1 1 1 1 1 1 1 1 1 1
symmnumber: 1
zpe: 716840.2 jmol-1
zpe.correction: 0.273030 hartree
zpe.thermalcorrener: 0.290569 hartree
zpe.thermalcorrenthalpy: 0.291513 hartree
zpe.thermalcorrgfe: 0.225765 hartree
zpe.sumelectzpe: -729.612058 hartree
zpe.sumelectthermal: -729.594519 hartree
zpe.sumelectthermalent: -729.593575 hartree
zpe.sumelectthermalfe: -729.659323 hartree
dipole: -0.4104 -0.0764 2.4084
dipole: 2.4443
quadrupole: -78.1743 -82.0247 -93.9091
quadrupole: 0.6487 0.1734 0.6625
quadrupole: 6.5284 2.6780 -9.2064 0.6487 0.1734 0.6625
hfenergy: -729.8850881 hartree
pointgroup: C01 [X(C11H18O4)]
dipole: -0.1231089 -0.0231861 -0.9534621 debye
polarizability: 149.0520326|-2.0019862|124.6839084|2.4032362|-0.5404615|121.3597982 unknown
InChI: InChI=1S/C11H18O4/c1-4-13-11(14-5-2,15-6-3)10-8-7-9-12-10/h7-9H,4-6H2,1-3H3
charge 0 multiplicity 1
33 atoms
O  0.644362 1.042246 1.058514
O  0.445495 -1.18661 1.073351
O  1.197117 -0.141457 -0.972041
O  -2.16251 0.204799 0.453247
C  0.295494 -0.056053 0.181654
C  -1.07681 0.065492 -0.437535
C  0.484697 2.388264 0.453395
C  0.016996 -2.486085 0.499803
C  2.623305 -0.348268 -0.602778
C  -1.539154 0.071901 -1.741796
C  -2.979056 0.221401 -1.68225
C  -3.317916 0.298063 -0.341768
C  1.073469 3.381652 1.453184
C  0.413965 -3.555655 1.515242
C  3.455736 0.01671 -1.830934
H  1.011249 2.420676 -0.520877
H  -0.591681 2.586387 0.278868
H  -1.079514 -2.472265 0.339401
H  0.511629 -2.643785 -0.479744
H  2.863253 0.286547 0.270047
H  2.770115 -1.406482 -0.312608
H  -0.913171 -0.018286 -2.625574
H  -3.667645 0.266004 -2.523685
H  -4.251646 0.41023 0.20201
H  0.96174 4.414449 1.074911
H  0.55356 3.305167 2.423369
H  2.146219 3.182413 1.620204
H  0.100332 -4.554304 1.159569
H  1.506846 -3.564314 1.670015
H  -0.069974 -3.361163 2.487506
H  4.52947 -0.148436 -1.624929
H  3.169413 -0.604393 -2.697808
H  3.311113 1.076757 -2.103063
