program: Gaussian 09
title: 000144742
version: EM64L-G09RevD.01
frameworkgroup: C1[X(C15H22N2)]
method: RPBEPBE
basis: SDD
operation: Freq
keyword: #pfreq=noraman
keyword: PBEPBE/SDD
title: #p freq=noraman PBEPBE/SDD
converged: YES YES NO NO
title: Mulliken charges:
elementType: N N C C C C C C C C C C C C C C C H H H H H H H H H H H H H H H H H H H H H H
charge: -0.249411 -0.256950 0.452390 -0.549393 -0.484075 -0.425127 -0.441743 0.245989 0.259682 -0.662740 -0.685196 -0.603828 -0.606374 0.368712 0.373722 -0.833510 -0.833589 0.233955 0.241787 0.224675 0.235867 0.221535 0.205045 0.222349 0.215115 0.222656 0.212829 0.234000 0.236087 0.215249 0.230923 0.226564 0.228464 0.224561 0.219259 0.218111 0.219269 0.224810 0.218331
chargesum: 0.00000
title: Mulliken charges with hydrogens summed into heavy atoms:
elementType: N N C C C C C C C C C C C C C C C
charge: -0.249411 -0.256950 0.452390 -0.073652 -0.023533 0.001454 -0.004278 0.245989 0.259682 0.006745 -0.002937 -0.377264 -0.377910 0.368712 0.373722 -0.171579 -0.171179
polarizability: 2.54875513e+02 -4.12941447e-01 1.73170303e+02 3.23377798e+00 6.54986158e-01 1.14537017e+02
1716.lowfreq: -11.0250 -0.0005 0.0003 0.0005 5.2988 7.1469 48.2064 59.3449 87.7176
frequency: 47.6050 59.1710 87.6837 106.3527 108.3377 137.0630 138.8472 149.7670 156.9701 188.0733 198.6136 222.1809 259.5975 269.6027 284.3358 292.4304 320.3403 348.6257 357.3703 378.4768 431.7913 462.8370 502.0420 513.7016 538.6778 593.3199 609.1359 631.4962 675.9473 682.0758 732.7861 735.2925 803.3140 822.0581 838.4660 842.7581 846.3111 857.9767 904.7316 945.2040 964.2196 994.5028 998.5376 1010.6441 1020.4807 1021.9723 1042.9126 1047.3190 1054.9881 1094.1689 1113.1417 1114.2028 1133.3340 1141.7683 1164.1208 1168.0078 1205.2268 1215.3459 1222.8328 1229.7927 1251.8660 1254.8891 1278.5669 1296.7211 1307.4146 1311.8166 1340.1692 1351.4106 1388.9667 1403.2333 1416.4441 1430.3640 1441.3758 1445.7359 1451.9003 1460.7638 1462.1115 1467.0198 1468.2103 1474.2167 1475.9806 1480.0793 1482.3325 1483.2066 1490.4931 1494.1410 1530.0473 1612.5192 1628.9438 2905.5638 2907.7901 2956.1223 2957.4017 2985.5330 2992.5429 2998.5924 3012.9444 3015.1836 3022.2782 3025.0609 3027.2019 3054.1586 3058.6127 3069.1134 3070.5390 3072.0624 3074.6874 3075.7207 3080.6629 3128.3189 3131.3369
redmass: 3.9576 2.4960 2.9313 1.1000 2.2141 1.2806 1.1653 1.1769 2.4805 2.2593 2.1465 2.3591 2.2253 2.3788 2.6108 2.2742 3.9643 3.4891 4.9712 3.5032 2.8480 4.1550 4.0480 2.9198 2.3249 3.9545 3.1011 4.3942 3.6117 2.4063 5.0946 3.4029 2.0622 2.1550 1.3889 1.4686 2.2787 2.3289 2.4783 1.5946 1.8850 1.4205 1.5297 1.5256 1.4112 2.6708 2.3179 1.5851 1.7651 2.8199 1.3355 1.3405 1.8080 2.9800 1.9481 2.0677 1.9231 1.4821 2.3609 1.6751 2.7343 1.4290 1.3061 1.3521 1.4851 1.5633 4.8036 5.8985 1.2333 1.2123 2.5308 2.1837 1.4698 1.2483 1.1079 1.0754 1.0479 1.0726 1.0826 1.0732 1.0471 1.1694 1.1003 1.1043 1.1606 1.1001 4.7109 8.8202 7.1498 1.0525 1.0518 1.0372 1.0382 1.0645 1.0617 1.0638 1.0635 1.0813 1.0973 1.0785 1.0970 1.0967 1.1005 1.0978 1.1028 1.0970 1.0989 1.0996 1.1030 1.0908 1.0912
irintensity: 0.5384 0.1432 0.0804 1.0354 9.4994 2.4430 0.2946 0.8958 0.4460 0.6489 1.0224 0.2077 0.1697 0.2650 0.7005 0.1138 0.0614 2.8842 2.2195 0.1721 7.2247 14.0327 4.0435 1.0123 0.9861 3.5956 3.8954 0.4553 2.4513 1.6506 0.6444 0.3369 2.3909 0.9467 46.5730 1.2565 12.5156 9.5486 2.4889 2.4139 23.0103 36.4667 2.5136 26.0575 13.1420 6.3242 16.0422 0.0120 14.4955 28.2348 19.7184 18.2841 26.6017 8.7246 1.4640 1.8280 3.5340 0.4822 0.4134 2.7043 32.4718 10.3247 6.5656 9.4417 2.2004 1.7364 75.0709 188.8889 3.8815 16.5306 0.0530 4.6497 13.4979 9.5449 16.7696 10.2700 0.0282 11.3549 18.9869 38.0789 23.8994 9.0097 1.7300 14.6174 24.2107 20.7476 380.1922 11.8635 29.0916 133.1126 108.3190 125.5171 21.8419 41.2304 40.8556 15.9083 14.5431 37.6796 58.2794 38.8592 0.1822 43.8480 34.3425 40.5832 26.1946 8.2752 18.5156 30.7192 46.8988 40.9122 1.4246
temp: 298.150 k
press: 1.00000 atm
elementType: 7 7 6 6 6 6 6 6 6 6 6 6 6 6 6 6 6 1 1 1 1 1 1 1 1 1 1 1 1 1 1 1 1 1 1 1 1 1 1
symmnumber: 1
zpe: 885483.3 jmol-1
zpe.correction: 0.337263 hartree
zpe.thermalcorrener: 0.354788 hartree
zpe.thermalcorrenthalpy: 0.355733 hartree
zpe.thermalcorrgfe: 0.293035 hartree
zpe.sumelectzpe: -693.002005 hartree
zpe.sumelectthermal: -692.984479 hartree
zpe.sumelectthermalent: -692.983535 hartree
zpe.sumelectthermalfe: -693.046233 hartree
dipole: -2.8507 0.0692 0.6471
dipole: 2.9240
quadrupole: -97.9308 -93.9393 -107.9442
quadrupole: -0.1406 0.3683 0.3885
quadrupole: 2.0073 5.9988 -8.0061 -0.1406 0.3683 0.3885
hfenergy: -693.3392676 hartree
pointgroup: C01 [X(C15H22N2)]
dipole: 1.1243806 -0.0263874 0.2418875 debye
polarizability: 254.7861898|-0.2860626|173.1729203|-4.8095621|-0.4662828|114.6237231 unknown
InChI: InChI=1S/C15H22N2/c1-11-9-13-14(10-12(11)2)17(4)15(16(13)3)7-5-6-8-15/h9-10H,5-8H2,1-4H3
charge 0 multiplicity 1
39 atoms
N  0.797062 1.104052 -0.409471
N  0.764877 -1.190074 -0.323442
C  1.723464 -0.052948 -0.185655
C  2.899618 -0.093902 -1.227733
C  2.451934 -0.014003 1.222827
C  4.218293 -0.234587 -0.424985
C  3.899952 0.443269 0.935918
C  -0.539894 0.690139 -0.221562
C  -0.558371 -0.734198 -0.178121
C  1.225025 2.479439 -0.196203
C  1.160698 -2.573904 -0.11895
C  -1.731417 1.421575 -0.119335
C  -1.768263 -1.429643 -0.040606
C  -2.973392 0.725864 0.013262
C  -2.991777 -0.696062 0.051073
C  -4.264858 1.521387 0.121481
C  -4.3041 -1.449741 0.19976
H  2.890621 0.850287 -1.801691
H  2.733728 -0.905596 -1.956194
H  2.46821 -1.038626 1.640518
H  1.90553 0.62369 1.93938
H  5.082161 0.220744 -0.940916
H  4.458613 -1.302864 -0.256413
H  4.607986 0.155591 1.733574
H  3.949793 1.544168 0.830194
H  2.227109 2.642518 -0.630099
H  1.258677 2.775724 0.877231
H  0.527803 3.163218 -0.712546
H  0.516958 -3.239012 -0.72429
H  1.086774 -2.906996 0.941304
H  2.201306 -2.724126 -0.455341
H  -1.727644 2.517373 -0.136083
H  -1.789508 -2.524465 0.003879
H  -4.068829 2.60704 0.078741
H  -4.969496 1.276837 -0.698086
H  -4.800656 1.315932 1.069615
H  -5.003856 -1.225319 -0.629623
H  -4.138533 -2.541219 0.209544
H  -4.830999 -1.183164 1.137547
