program: Gaussian 09
title: 000144739
version: EM64L-G09RevD.01
frameworkgroup: C1[X(C11H13NO9)]
method: RPBEPBE
basis: SDD
operation: Freq
keyword: #p
keyword: freq=noraman
keyword: PBEPBE/SDD
title: #p freq=noraman PBEPBE/SDD
converged: YES YES NO NO
title: Mulliken charges:
elementType: O O O O O O O O O N C C C C C C C C C C C H H H H H H H H H H H H H
charge: -0.232720 -0.252675 -0.245310 -0.259703 -0.197641 -0.164500 -0.227082 -0.195844 -0.210529 0.132454 0.228844 -0.036845 -0.090382 -0.227098 -0.188449 0.329579 0.328054 0.323158 -0.752780 -0.756071 -0.757117 0.312137 0.304622 0.292554 0.275287 0.246589 0.251842 0.258163 0.251492 0.256362 0.248860 0.255823 0.247233 0.251690
chargesum: 0.00000
title: Mulliken charges with hydrogens summed into heavy atoms:
elementType: O O O O O O O O O N C C C C C C C C C C C
charge: -0.232720 -0.252675 -0.245310 -0.259703 -0.197641 -0.164500 -0.227082 -0.195844 -0.210529 0.132454 0.228844 0.275292 0.214240 0.065456 0.086839 0.329579 0.328054 0.323158 0.003814 0.000644 -0.002371
polarizability: 1.77039838e+02 -1.00661870e+01 1.58355853e+02 -3.14449833e+00 -3.23206760e+00 1.30807987e+02
1716.lowfreq: -32.4206 -7.5491 -2.7299 -0.0003 0.0002 0.0009 6.1502 23.0987 32.1278
frequency: -32.2367 22.9952 32.0817 32.3925 41.9065 45.3698 59.3838 61.4258 72.5560 76.4097 78.5230 88.4047 120.0314 129.3989 153.1139 198.1070 201.9380 222.0210 231.6835 268.8929 279.8130 324.7970 336.6845 364.3850 393.1818 426.6946 478.6886 504.6041 507.1528 548.1357 560.3864 562.5857 584.4725 623.3989 632.8312 665.4044 679.3188 704.6315 747.5519 781.5294 803.5906 810.7276 822.1889 830.1916 894.7649 923.9808 943.8126 949.2228 965.6199 969.6337 982.9538 986.7001 1014.8460 1032.2251 1041.2328 1041.4907 1042.4746 1089.1756 1118.0098 1160.5598 1165.6370 1172.5644 1187.6157 1198.2780 1234.7844 1267.8307 1306.9503 1324.1966 1348.5553 1382.5012 1383.9601 1384.9690 1443.4696 1450.3683 1450.9147 1451.6427 1452.4196 1453.0141 1453.6606 1626.1832 1665.8437 1674.8211 1702.6014 3008.9435 3009.3777 3009.7756 3035.3205 3097.1178 3098.5069 3099.1689 3100.7129 3144.5991 3144.7470 3146.1454 3203.6796 3233.8152
redmass: 1.0966 5.2965 4.4564 1.4875 8.6534 3.8997 3.6033 4.1644 3.1637 3.4714 2.8291 1.7750 6.0275 7.4042 5.6557 5.9077 9.4086 6.8279 7.9067 4.6123 6.0204 4.5237 5.9952 4.5924 5.1097 5.1316 4.2621 4.8402 4.3598 3.1643 3.5227 3.1645 5.7806 6.6458 5.9830 3.4608 8.3242 5.3882 3.3386 7.2222 6.8827 3.2054 4.2215 6.9384 6.9344 9.0365 1.3667 3.9554 3.1633 2.7602 2.0144 2.1340 3.1310 3.0178 1.6684 1.6757 1.6626 3.7524 1.4320 2.8041 2.8351 2.1491 3.7096 3.4316 2.5613 1.4864 1.8021 1.2804 1.4786 1.2355 1.2424 1.2524 7.9032 1.0484 1.0576 1.0568 1.0537 1.0491 1.0488 6.9773 9.9924 10.0707 10.3142 1.0368 1.0366 1.0372 1.0858 1.0971 1.0968 1.0882 1.0961 1.1016 1.1011 1.1016 1.0891 1.1093
irintensity: 1.5449 0.0733 0.7590 1.6210 1.2358 0.8279 2.8336 0.8431 0.6527 0.2796 1.6300 0.4370 5.5060 6.5877 3.7642 11.9292 2.3638 1.0614 2.9878 0.6608 1.1134 8.1239 1.4788 7.3652 6.6031 7.1482 11.0170 9.6666 15.1358 3.1899 10.7817 1.3165 2.9918 8.3513 17.4618 3.8761 19.2677 9.1970 48.5939 3.1624 34.9757 39.2592 35.9455 51.4053 264.0814 429.4094 3.0263 64.4576 81.0933 31.2484 21.9813 69.1574 121.7465 166.7751 1.2388 23.8452 12.9795 37.7313 6.5221 197.8669 351.8313 41.7801 253.1675 67.4725 63.0293 1.1663 18.1315 1.6780 11.9619 36.2001 61.3523 81.9683 154.4155 24.1962 17.4921 24.9044 29.5034 13.5290 23.5395 2.0915 184.4373 117.9298 188.8266 1.2718 0.8419 1.2226 12.9968 5.8292 4.8721 2.7234 5.5123 12.1469 5.7690 7.9759 1.3911 0.2005
temp: 298.150 k
press: 1.00000 atm
elementType: 8 8 8 8 8 8 8 8 8 7 6 6 6 6 6 6 6 6 6 6 6 1 1 1 1 1 1 1 1 1 1 1 1 1
symmnumber: 1
zpe: 626729.4 jmol-1
zpe.correction: 0.238709 hartree
zpe.thermalcorrener: 0.260721 hartree
zpe.thermalcorrenthalpy: 0.261665 hartree
zpe.thermalcorrgfe: 0.183667 hartree
zpe.sumelectzpe: -1157.036482 hartree
zpe.sumelectthermal: -1157.014470 hartree
zpe.sumelectthermalent: -1157.013526 hartree
zpe.sumelectthermalfe: -1157.091524 hartree
dipole: -2.2528 6.8504 -1.4812
dipole: 7.3619
quadrupole: -122.8817 -131.6833 -100.7409
quadrupole: -2.5987 -2.7062 -1.3781
quadrupole: -4.4464 -13.2480 17.6944 -2.5987 -2.7062 -1.3781
hfenergy: -1157.2751906 hartree
pointgroup: C01 [X(C11H13N1O9)]
dipole: 1.4131785 -2.4625451 -0.5725473 debye
polarizability: 175.9297134|-8.8407166|154.7729939|12.4183149|4.6115085|135.5009712 unknown
InChI: InChI=1S/C11H13NO9/c1-6(13)18-10(19-7(2)14)11(20-8(3)15)5-4-9(21-11)12(16)17/h4-5,9-10H,1-3H3
charge 0 multiplicity 1
34 atoms
O  -1.559012 -0.126194 0.229875
O  -0.062799 -2.016716 0.10114
O  1.121486 0.030758 1.450443
O  2.001774 -0.272727 -0.742046
O  -4.057885 2.025541 -1.061926
O  -1.881575 2.513744 -0.548703
O  -2.209442 -2.838981 -0.422326
O  0.669729 2.305916 1.859634
O  3.271365 1.539705 0.018292
N  -2.845472 1.710987 -0.780386
C  -0.341822 -0.657277 -0.405921
C  0.85263 0.21281 0.03709
C  -2.537848 0.152014 -0.787939
C  -0.635391 -0.62948 -1.89519
C  -1.897856 -0.195767 -2.111397
C  -1.071861 -3.012397 0.05474
C  1.057052 1.205366 2.276213
C  3.191344 0.498745 -0.658471
C  -0.536678 -4.275408 0.688346
C  1.521571 0.848944 3.665014
C  4.278959 -0.153071 -1.477943
H  0.648086 1.281277 -0.169399
H  -3.504883 -0.322682 -0.56267
H  0.103308 -0.955026 -2.626167
H  -2.421371 -0.096877 -3.062696
H  -1.266942 -5.088118 0.566458
H  0.428122 -4.555528 0.233278
H  -0.352088 -4.101169 1.763005
H  1.035434 -0.079279 4.007269
H  2.611498 0.669376 3.651218
H  1.29864 1.675787 4.354289
H  4.527894 -1.139606 -1.048991
H  3.935086 -0.322012 -2.512529
H  5.173848 0.485244 -1.479206
