program: Gaussian 09
title: 000144738
version: EM64L-G09RevD.01
frameworkgroup: C1[X(C10H14NP)]
method: RPBEPBE
basis: SDD
operation: Freq
keyword: #p
keyword: freq=noraman
keyword: PBEPBE/SDD
title: #p freq=noraman PBEPBE/SDD
converged: YES YES NO NO
title: Mulliken charges:
elementType: P N C C C C C C C C C C H H H H H H H H H H H H H H
charge: 0.423985 -0.044016 -0.202187 -0.240298 -0.640387 -0.627876 -0.749389 -0.307170 -0.264762 -0.217063 -0.228183 -0.241735 0.258873 0.232698 0.228915 0.207320 0.248038 0.262510 0.282940 0.223256 0.233465 0.244035 0.245923 0.222769 0.223437 0.224901
chargesum: 0.00000
title: Mulliken charges with hydrogens summed into heavy atoms:
elementType: P N C C C C C C C C C C
charge: 0.423985 -0.044016 -0.202187 -0.240298 0.080099 0.089992 -0.009728 -0.063135 -0.018840 0.005706 -0.004745 -0.016834
polarizability: 2.24944504e+02 -1.53787036e+00 1.18824348e+02 4.03987632e+00 -1.04536592e+01 9.61592222e+01
1716.lowfreq: -13.1023 -0.0020 -0.0011 -0.0011 8.0488 9.3770 23.5145 49.3119 68.6089
frequency: 22.7823 49.1109 68.5783 77.1234 99.2570 162.0910 212.4569 218.2853 228.7440 256.3109 276.8380 370.1996 396.9813 408.1019 436.3215 465.6130 483.8342 514.9639 613.1214 625.7571 674.2830 702.1054 752.0538 837.9836 853.7731 918.3936 974.1900 985.1002 991.0541 1013.6322 1017.9547 1020.6175 1054.6522 1069.2014 1077.7084 1086.1146 1127.3747 1155.3439 1168.9260 1169.3815 1185.5797 1280.7071 1297.3683 1362.3117 1386.2865 1390.9058 1418.9125 1428.7708 1446.3427 1452.8635 1457.5347 1466.2574 1473.4079 1484.2051 1488.2060 1508.2050 1574.0986 1588.5843 2944.3302 2952.8751 2964.9983 3023.0360 3038.4587 3045.7227 3093.4684 3114.8114 3119.1644 3119.8010 3123.5209 3133.2791 3141.5208 3158.9683
redmass: 3.5667 2.5733 2.0902 1.8433 2.4002 1.3169 3.3597 2.7432 1.7932 1.7125 3.6252 3.1855 2.8162 3.9978 3.3337 3.5258 3.8798 3.8022 6.3034 4.1889 6.6085 1.8631 1.7484 2.7063 1.2502 1.3819 1.4000 5.8788 1.3161 1.8340 2.7854 1.4552 1.4937 1.6460 2.5076 1.2402 1.3794 2.8786 1.2467 1.7361 1.1191 4.6957 1.3869 6.2777 2.0962 1.3709 2.1442 1.1320 1.0902 1.0826 2.0351 1.0783 1.0700 1.0758 1.0615 1.2654 5.8196 5.9256 1.0440 1.0411 1.0408 1.0977 1.0974 1.0890 1.0987 1.0843 1.0942 1.0891 1.0940 1.0920 1.0965 1.1016
irintensity: 1.2719 0.8808 0.7149 1.1132 0.3304 0.4815 0.4555 8.2032 1.4097 2.5117 1.6383 0.5524 0.1049 6.5970 0.2533 1.6678 7.5250 16.7927 0.1870 2.2029 1.3310 51.3030 52.9965 1.5226 1.0179 1.7826 0.2946 1.9250 0.1023 54.3645 1.8019 4.3413 12.8541 8.7981 0.5597 4.3977 34.9573 50.1324 7.4732 17.3542 0.5634 43.5661 2.6906 1.6324 173.3925 33.8145 11.4871 16.2846 45.8482 2.5702 15.1066 16.3947 12.0924 7.2882 13.8873 148.1260 0.9423 11.5378 68.9812 106.5132 41.4047 20.9092 19.3509 34.3274 33.3656 4.8929 12.3282 3.8504 2.3342 9.0579 47.7896 37.2490
temp: 298.150 k
press: 1.00000 atm
elementType: 15 7 6 6 6 6 6 6 6 6 6 6 1 1 1 1 1 1 1 1 1 1 1 1 1 1
symmnumber: 1
zpe: 564044.2 jmol-1
zpe.correction: 0.214833 hartree
zpe.thermalcorrener: 0.228132 hartree
zpe.thermalcorrenthalpy: 0.229076 hartree
zpe.thermalcorrgfe: 0.173594 hartree
zpe.sumelectzpe: -784.517300 hartree
zpe.sumelectthermal: -784.504001 hartree
zpe.sumelectthermalent: -784.503057 hartree
zpe.sumelectthermalfe: -784.558539 hartree
dipole: -3.2760 2.3704 0.8054
dipole: 4.1230
quadrupole: -61.2863 -79.8055 -80.5945
quadrupole: -0.7753 0.7362 -2.9751
quadrupole: 12.6091 -5.9101 -6.6990 -0.7753 0.7362 -2.9751
hfenergy: -784.732133 hartree
pointgroup: C01 [X(C10H14N1P1)]
dipole: -1.2747857 0.9703641 0.2542236 debye
dipolederiv: -0.1612479 0.147999 0.006685 0.6169058 -0.0752087 0.0335075 -0.0163291 -0.0110524 -0.1450958 -1.6318922 0.3077451 0.032598 0.1797286 -0.443216 -0.0661915 -0.4326438 0.061127 -0.2562761 1.5323593 -0.4891968 -0.0011493 -0.4760631 0.1678522 0.0744035 0.317962 0.0209673 -0.1316618 0.4665867 0.048221 0.0293022 -0.0149427 -0.2158131 -0.0214177 0.0143461 -0.0256731 -0.0932433 0.4158677 -0.194021 -0.1240255 -0.4411757 0.2747021 0.0397159 -0.1253909 0.0121359 0.2934051 0.1574805 0.0162965 0.0107924 0.3233067 0.2504031 -0.0105009 0.1824012 -0.0306896 0.1807271 -0.1361349 0.0189528 -0.0137799 -0.0599475 -0.1250819 -0.1196319 -0.097307 -0.0933707 0.1396222 -0.328607 0.0446248 -0.0522476 -0.0098906 -0.0031581 -0.1065294 0.0106446 -0.0942113 -0.0287341 -0.3043377 -0.043675 0.0840899 -0.1149089 -0.0834869 -0.0767149 0.0045753 -0.0702559 -0.0196148 0.031701 -0.0144841 0.1083408 0.0426043 -0.060926 -0.0895566 0.1095068 -0.1098499 -0.0052523 0.0109995 0.0597833 -0.0202152 0.0388066 -0.0155175 -0.1247238 0.0123236 -0.1190234 -0.0122715 -0.0204455 0.0736665 0.0267641 0.0290651 -0.1127491 -0.0519815 0.0182334 -0.0387607 -0.1107948 0.1044031 -0.105894 0.0232143 -0.0155835 -0.0959781 -0.0155074 0.0390467 -0.0172023 0.0892397 -0.0874608 0.0765099 0.0820617 0.0770937 0.0302612 0.0602659 0.2446976 -0.0368872 -0.1520959 -0.1515202 0.0614915 -0.0835827 0.0005576 0.101063 -0.0332467 -0.1408959 0.0043996 -0.0133714 -0.2134176 -0.0184251 -0.0810256 0.1007589 0.0887337 0.0244687 -0.038936 0.0059723 0.1081094 0.0885419 0.0393516 -0.0314022 -0.1383994 -0.0507163 0.0582777 -0.0006154 0.1118522 -0.0460193 0.1333246 0.0728776 0.1325114 -0.0384244 0.0342217 -0.0367347 0.0582466 -0.030214 -0.0223587 -0.0109947 -0.0565746 -0.0462122 -0.033032 0.1057088 0.0208927 -0.0548932 0.029485 0.0900369 0.1043122 0.0424453 -0.0382844 0.0790829 -0.0932933 0.0427048 -0.0535946 0.1072035 -0.0068012 0.0081442 0.0438498 0.1088565 0.0201172 0.0166405 -0.034335 0.1082146 -0.0866244 -0.0662128 0.1119797 -0.0831834 0.0452387 -0.0610143 0.0345833 0.1071272 0.0254744 0.0895224 0.0366659 0.03292 0.0434984 -0.1083116 0.0351159 0.0673338 0.0641412 -0.0838405 0.0665234 0.0251124 -0.0345567 0.043397 -0.1022694 0.0447424 0.0820317 0.0974707 -0.1326844 0.0956004 0.0082446 0.0200008 -0.0625384 0.035851 -0.0964015 0.0157919 0.1326304 0.0603269 0.1295533 0.0205915 -0.1380058 -0.0727176 -0.0238004 -0.0881021 0.1058181 0.0314659 -0.028869 0.0294728 0.118049 unknown
polarizability: 224.5618144|-3.4440291|118.2215633|7.0278604|-11.3542475|97.144696 unknown
InChI: InChI=1S/C10H14NP/c1-9(11(2)3)12-10-7-5-4-6-8-10/h4-8H,1-3H3
charge 0 multiplicity 1
26 atoms
P  -0.698232 -1.240867 -0.142541
N  -3.099044 0.075879 -0.052304
C  -1.729299 0.19619 0.145469
C  1.042997 -0.536644 0.021605
C  -4.076077 1.082923 0.397825
C  -3.648996 -1.218268 -0.48788
C  -1.230815 1.539575 0.645399
C  1.922859 -1.103175 0.98424
C  1.564818 0.438648 -0.873565
C  3.274188 -0.692904 1.065797
C  2.913163 0.855404 -0.790065
C  3.773956 0.291301 0.181282
H  -3.633869 2.089433 0.402086
H  -4.456532 0.865729 1.4184
H  -4.936273 1.092803 -0.295058
H  -4.712766 -1.100667 -0.751994
H  -3.553069 -1.990314 0.303461
H  -3.087137 -1.58366 -1.368971
H  -0.143123 1.509709 0.794861
H  -1.452744 2.356714 -0.069595
H  -1.698376 1.803697 1.614003
H  1.542407 -1.865435 1.674487
H  0.911912 0.862067 -1.646259
H  3.933305 -1.14018 1.819188
H  3.293228 1.609764 -1.489189
H  4.821218 0.608879 0.242719
