program: Gaussian 09
title: 000144737
version: EM64L-G09RevD.01
frameworkgroup: C1[X(C12H10S3)]
method: RPBEPBE
basis: SDD
operation: Freq
keyword: #pfreq=noraman
keyword: PBEPBE/SDD
title: #p freq=noraman PBEPBE/SDD
converged: NO YES NO NO
title: Mulliken charges:
elementType: S S S C C C C C C C C C C C C H H H H H H H H H H
charge: 0.051803 0.051800 -0.066383 0.079738 0.438709 0.438683 0.410045 -0.926888 -0.926894 -0.367273 -0.367224 -0.437912 -0.437910 -0.267112 -0.267119 0.291370 0.296972 0.296976 0.291370 0.229441 0.229442 0.243264 0.243264 0.235918 0.235918
chargesum: 0.00000
title: Mulliken charges with hydrogens summed into heavy atoms:
elementType: S S S C C C C C C C C C C C C
charge: 0.051803 0.051800 -0.066383 0.079738 0.438709 0.438683 0.410045 -0.338546 -0.338547 -0.137832 -0.137782 -0.194647 -0.194646 -0.031194 -0.031201
polarizability: 2.38703863e+02 6.10115119e-03 2.32594217e+02 8.98779653e+00 -2.19566283e-03 9.47880685e+01
1716.lowfreq: -8.6816 -8.0919 -0.0021 0.0018 0.0030 10.3628 31.9963 84.2199 121.1152
frequency: 31.9425 84.2195 121.1145 141.5008 154.5357 173.0496 200.9447 248.0449 288.9658 320.0202 354.6634 365.4248 403.5425 443.9597 475.8435 485.1050 494.1107 518.3062 538.4894 560.5688 591.3248 629.9933 662.2499 677.6008 778.3065 779.5010 786.3323 810.0606 851.8284 855.4749 875.4496 915.0827 934.9229 981.4754 982.0633 994.3461 1022.1185 1097.3764 1105.9098 1129.4461 1148.0604 1176.2246 1178.5954 1211.5540 1228.9523 1238.6454 1252.6424 1268.0780 1378.9688 1380.2229 1388.6975 1427.5281 1440.7149 1455.4276 1487.7147 1523.2724 1582.3135 1605.3065 1618.9684 3047.8828 3050.4289 3120.6782 3121.0422 3129.5968 3132.4175 3138.3895 3152.1248 3162.3668 3163.6806
redmass: 8.6796 7.4152 5.6218 8.3835 6.9808 6.8845 18.0476 3.7556 6.2419 2.4688 3.7067 17.4659 22.5113 4.2725 3.3212 4.8536 5.8387 3.0315 5.2461 5.9491 5.1357 4.4016 4.3728 2.8378 1.3446 4.2661 1.8737 4.7669 2.4801 1.6627 1.8121 1.3916 1.4685 3.7446 1.3593 1.4074 3.4421 1.7373 1.2637 2.0432 1.2760 1.3080 1.1971 1.2004 1.1456 1.5518 2.2527 2.4497 2.7928 4.0847 3.3836 1.9120 1.2344 2.0093 1.1014 4.8612 6.2241 5.7089 6.0690 1.0650 1.0670 1.0880 1.0878 1.0907 1.0895 1.1011 1.0942 1.0998 1.0996
irintensity: 0.1653 0.6524 0.1431 0.4252 0.2319 3.0115 1.1719 0.0003 7.2744 9.2166 2.2679 17.0357 0.3721 0.0281 0.0582 0.4120 0.0042 2.5293 10.3024 1.6599 0.0000 22.6531 0.9619 0.2760 0.0086 12.1606 76.5928 0.3029 26.8402 3.0589 9.3323 0.0716 1.6422 4.8711 0.1279 2.4363 2.6743 1.6067 0.3877 9.3835 22.6338 1.2425 5.8772 5.0183 10.9437 0.1185 4.5412 1.8898 3.6929 2.7010 3.5412 0.0214 9.1018 3.2423 30.9773 10.0013 0.2203 6.2991 0.2442 6.4917 24.9609 5.5015 10.4042 3.5675 17.9594 0.6708 3.3535 33.6600 23.9021
temp: 298.150 k
press: 1.00000 atm
elementType: 16 16 16 6 6 6 6 6 6 6 6 6 6 6 6 1 1 1 1 1 1 1 1 1 1
symmnumber: 1
zpe: 484940.4 jmol-1
zpe.correction: 0.184704 hartree
zpe.thermalcorrener: 0.197806 hartree
zpe.thermalcorrenthalpy: 0.198750 hartree
zpe.thermalcorrgfe: 0.144394 hartree
zpe.sumelectzpe: -1656.409374 hartree
zpe.sumelectthermal: -1656.396272 hartree
zpe.sumelectthermalent: -1656.395328 hartree
zpe.sumelectthermalfe: -1656.449685 hartree
dipole: -3.6421 0.0000 2.0727
dipole: 4.1906
quadrupole: -108.8148 -98.3908 -113.0386
quadrupole: 0.0002 7.5532 -0.0013
quadrupole: -2.0667 8.3573 -6.2906 0.0002 7.5532 -0.0013
hfenergy: -1656.5940785 hartree
pointgroup: C01 [X(C12H10S3)]
dipole: 1.3948345 0.0001117 -0.8790039 debye
dipolederiv: -0.2695637 0.2202897 -0.0473441 -0.068969 -0.3659224 -0.0269555 0.0536228 0.0297164 -0.0174142 -0.2695721 -0.2202057 -0.047307 0.069031 -0.3660001 0.0270757 0.0535845 -0.0295843 -0.017415 -0.1789452 -0.0001504 0.1012592 -0.0001256 0.5799737 -0.0001081 0.0827957 -0.0001117 -0.1476235 -0.223377 -0.0000556 -0.0118487 -0.000065 0.1167429 -0.000004 -0.0535049 -0.0000505 -0.0066176 0.0284108 0.04307 0.018066 0.0806824 -0.0782349 -0.0097827 -0.0107648 -0.0463939 -0.1130672 0.0284747 -0.0430657 0.018111 -0.0806591 -0.0782911 0.0097724 -0.0107718 0.0463784 -0.1130742 -0.1247786 -0.0000287 -0.0439472 -0.0000297 0.0121729 -0.0000008 -0.0640628 0.0000083 0.0668039 0.4805741 -0.0171384 -0.0983201 0.0761335 0.0315272 0.063911 -0.1209957 0.0870963 0.1347656 0.4806304 0.0172744 -0.0982934 -0.0759912 0.031439 -0.063914 -0.1208637 -0.0870789 0.1347808 0.035834 0.0862113 0.0624722 0.0487163 0.0230778 0.0321119 0.0694324 -0.0080054 -0.1260599 0.0358704 -0.08619 0.0624824 -0.0487201 0.0230179 -0.0321102 0.0693924 0.0080295 -0.1260515 0.0646581 -0.0171501 0.0864155 0.0746552 0.0052355 0.0121494 0.0702589 -0.004214 -0.141314 0.0646831 0.0171674 0.0864214 -0.0746324 0.0051964 -0.0121054 0.0702426 0.0042484 -0.1413147 -0.0370167 -0.1245386 0.0346792 -0.1904216 0.0363665 -0.0297124 0.0238421 -0.0276848 -0.1306923 -0.0371521 0.1244948 0.0346816 0.1903778 0.036505 0.0297474 0.0238844 0.0277361 -0.1306816 -0.0582621 0.0195614 -0.0046233 0.0332564 0.0663201 0.1103424 0.0206345 0.0406916 0.0035768 0.0323401 0.06691 0.0591927 -0.0579371 -0.0427292 -0.0997977 0.0464612 -0.0506243 0.0302185 0.0323155 -0.0668715 0.0591741 0.0579644 -0.0426747 0.0998267 0.0464392 0.0506286 0.0302078 -0.0582249 -0.0196007 -0.0045699 -0.0332827 0.0662662 -0.1103732 0.0206393 -0.040708 0.0036087 0.0433767 -0.1225125 -0.0381662 -0.0802492 -0.0450691 -0.0236595 -0.02757 -0.027599 0.1191161 0.043313 0.122543 -0.0381837 0.0802859 -0.0449797 0.0236493 -0.0276093 0.0275962 0.1191043 -0.0892303 0.0186215 -0.0657873 -0.0560915 0.0806749 -0.0144085 -0.0688914 0.0038499 0.1332507 -0.0892419 -0.0186811 -0.065799 0.0560263 0.0806894 0.0143776 -0.0688932 -0.0038936 0.1332489 0.0323991 0.0883684 -0.0293797 0.107684 -0.0656146 0.0214653 -0.0386507 0.0221915 0.1513258 0.0324846 -0.0883229 -0.0293856 -0.1076391 -0.0656897 -0.0214969 -0.0386518 -0.0222228 0.1513177 unknown
polarizability: 239.2200878|-0.0052553|232.5942162|2.4942338|-0.0029653|94.2718445 unknown
InChI: InChI=1S/C12H10S3/c1-3-9-4-2-6-11-8-14-15-13-7-10(5-1)12(9)11/h1-6H,7-8H2
charge 0 multiplicity 1
25 atoms
S  -2.709736 -1.778816 0.737256
S  -2.710571 1.778159 0.736671
S  -4.067433 -0.000719 0.357607
C  0.491582 0.000009 -0.236107
C  -0.124093 -1.312475 -0.423451
C  -0.124589 1.312245 -0.423516
C  1.900292 0.000287 0.172891
C  -1.555417 -1.618588 -0.808015
C  -1.555957 1.61781 -0.808369
C  0.644604 -2.475965 -0.211902
C  0.643623 2.476041 -0.21187
C  2.621369 -1.221105 0.377855
C  2.620859 1.221959 0.377954
C  2.006428 -2.452494 0.188478
C  2.005415 2.453109 0.188635
H  -2.052722 -0.906089 -1.475593
H  -1.609262 -2.612822 -1.280141
H  -1.610034 2.611899 -1.280777
H  -2.052932 0.904973 -1.475829
H  0.160459 -3.449174 -0.359078
H  0.159103 3.449057 -0.359095
H  3.671838 -1.159128 0.684822
H  3.671346 1.160397 0.684944
H  2.551668 -3.389487 0.338885
H  2.550258 3.390317 0.339144
