program: Gaussian 09
title: 000144736
version: EM64L-G09RevD.01
frameworkgroup: C1[X(C12H10S2)]
method: RPBEPBE
basis: SDD
operation: Freq
keyword: #pfreq=noraman
keyword: PBEPBE/SDD
title: #p freq=noraman PBEPBE/SDD
converged: YES YES NO NO
title: Mulliken charges:
elementType: S S C C C C C C C C C C C C H H H H H H H H H H
charge: 0.054941 0.050932 0.103735 0.477524 0.450751 0.419479 -0.936063 -0.943051 -0.421853 -0.443390 -0.443729 -0.444939 -0.251072 -0.248733 0.271668 0.298532 0.304474 0.291140 0.232225 0.229209 0.241491 0.241516 0.232649 0.232563
chargesum: 0.00000
title: Mulliken charges with hydrogens summed into heavy atoms:
elementType: S S C C C C C C C C C C C C
charge: 0.054941 0.050932 0.103735 0.477524 0.450751 0.419479 -0.365863 -0.347437 -0.189628 -0.214181 -0.202238 -0.203423 -0.018423 -0.016170
polarizability: 1.97241300e+02 -1.03734478e+01 2.01216689e+02 -5.83721664e+00 -1.36979047e+00 8.82883980e+01
1716.lowfreq: -12.8178 -8.5783 -0.0015 0.0015 0.0030 5.2152 45.2987 105.1389 127.1301
frequency: 45.2541 105.1365 127.1255 162.9496 205.4450 250.8643 293.9596 338.8275 344.9354 407.6736 433.9248 464.1759 474.4549 493.9870 519.1377 547.1583 560.9992 615.2992 635.8956 673.2686 679.6997 771.5266 777.8742 784.9909 809.3356 838.1474 859.6871 877.8641 909.7536 928.3895 978.0292 990.1364 999.3501 1031.9598 1094.4583 1119.4597 1129.1332 1151.1472 1175.7801 1180.5587 1221.3301 1239.2598 1245.8445 1253.7521 1272.8974 1378.8996 1387.4727 1395.7842 1426.7067 1432.7949 1456.8196 1474.5596 1518.9905 1588.3135 1600.4710 1621.8435 3024.3221 3036.5983 3093.8821 3103.4469 3120.7512 3123.5982 3129.3127 3131.7780 3159.4728 3161.0611
redmass: 9.0821 6.9565 5.5425 4.5555 7.2085 3.7347 6.0603 3.3644 2.4017 13.4630 4.8726 3.9396 3.2527 5.6219 3.9540 5.0997 5.3590 5.0184 4.3877 4.7188 3.2474 1.3237 3.2539 2.1972 4.6330 2.0777 1.7148 2.0097 1.4233 1.4881 1.3623 1.4066 3.8919 4.2775 1.8711 1.9141 1.2137 1.1420 1.2465 1.1878 1.2061 1.3660 1.4209 2.0296 2.3830 2.2678 3.8001 4.8611 1.6970 1.3192 2.4531 1.1000 4.8194 6.9117 5.6138 6.4320 1.0616 1.0606 1.1035 1.1004 1.0871 1.0864 1.0913 1.0909 1.0996 1.0994
irintensity: 0.3024 2.1624 0.7671 1.2201 0.8388 0.6600 7.5072 0.3295 2.6188 0.3106 0.8140 1.4863 0.4593 0.3296 2.3577 5.2358 2.3263 0.2210 12.7540 11.4126 0.1559 0.1383 26.6667 60.9931 1.0286 22.8862 6.4750 17.5811 0.8099 0.9276 0.1397 2.8609 0.9918 6.2236 0.3570 7.3396 5.0615 13.1583 2.0987 4.6870 3.8455 2.1465 2.4678 5.1000 0.7956 7.3340 2.2550 1.0616 3.9702 11.8444 0.3183 30.2303 8.5993 4.4677 3.3594 1.6393 9.5900 19.2635 2.9746 6.5911 6.4368 1.7978 6.7848 22.2638 39.5798 21.6645
temp: 298.150 k
press: 1.00000 atm
elementType: 16 16 6 6 6 6 6 6 6 6 6 6 6 6 1 1 1 1 1 1 1 1 1 1
symmnumber: 1
zpe: 480825.3 jmol-1
zpe.correction: 0.183137 hartree
zpe.thermalcorrener: 0.194505 hartree
zpe.thermalcorrenthalpy: 0.195449 hartree
zpe.thermalcorrgfe: 0.145365 hartree
zpe.sumelectzpe: -1258.424516 hartree
zpe.sumelectthermal: -1258.413148 hartree
zpe.sumelectthermalent: -1258.412204 hartree
zpe.sumelectthermalfe: -1258.462288 hartree
dipole: 2.6191 0.0887 1.9032
dipole: 3.2388
quadrupole: -97.0058 -83.3089 -100.1116
quadrupole: -1.1678 -6.7108 -1.0015
quadrupole: -3.5303 10.1666 -6.6362 -1.1678 -6.7108 -1.0015
hfenergy: -1258.6076527 hartree
pointgroup: C01 [X(C12H10S2)]
dipole: -0.9878273 0.0663352 -0.802198 debye
dipolederiv: -0.265406 0.09285 0.0178982 0.1240328 -0.03237 -0.0314265 -0.0493894 0.0223921 -0.1660115 -0.3585761 0.0143532 -0.012049 0.0011952 -0.0513119 -0.0419936 -0.1368245 -0.0275767 -0.0207729 -0.1467248 0.0496838 0.0085152 0.0903409 0.0822361 -0.0044291 0.0519561 -0.0668197 -0.0178571 0.1022077 0.0109589 -0.0562031 0.0090355 -0.0259723 0.0275424 -0.0868889 0.0431181 -0.1048099 0.1529933 -0.0389797 0.0186598 -0.0384161 -0.0465572 -0.0321612 0.0519338 -0.0359175 -0.088454 -0.128011 0.0534407 0.0336643 0.0693656 0.057894 0.008802 0.0640396 0.0097388 0.0766767 0.3158791 -0.120845 0.0856383 -0.1014144 -0.0140736 0.0170064 0.1045684 0.0022829 0.169774 0.3453759 0.0030215 0.0981752 -0.0751617 0.0404334 0.0675631 0.1163207 0.0379511 0.102142 -0.0053167 0.081539 -0.0515888 0.109591 -0.0320125 -0.0105382 -0.0043789 -0.0004067 -0.1325589 -0.099761 -0.0678661 -0.0509946 -0.1120981 0.0544119 0.0168041 -0.0668838 -0.0034599 -0.1615774 0.063182 -0.040188 -0.057488 -0.0106375 -0.0351675 0.0197927 -0.0515404 0.024766 -0.1645962 0.0551583 0.0058335 -0.0598972 -0.0556955 -0.0385997 0.0214209 -0.0599881 0.0204729 -0.1655203 -0.0133414 -0.0772233 -0.03051 -0.1119555 0.0853196 0.0475112 -0.0332509 0.0520484 -0.1249372 0.0907078 0.0773086 -0.0252596 0.1366715 -0.0086384 -0.0041406 0.0166869 0.005161 -0.1339648 -0.0372625 0.02913 -0.0595247 0.0487531 0.0355841 -0.1265361 -0.01987 -0.0460907 -0.0342947 0.0313242 0.0418571 -0.0265388 -0.0782578 -0.0267553 0.0809585 -0.0160547 0.0418508 0.0725482 0.0593618 -0.1014108 -0.0395689 0.044188 -0.0761999 -0.0303439 -0.049722 -0.0183824 0.0858129 -0.0754735 -0.0060383 0.0283697 -0.045086 0.1231953 0.0601972 0.0059087 -0.000276 -0.0500853 -0.0080025 -0.1277776 0.03467 -0.0870656 -0.0040389 0.0017681 0.0371311 0.0247726 0.1252018 0.0640881 0.1011753 0.0170214 0.0578717 -0.0981715 -0.0161027 -0.0103997 -0.0026069 0.1389591 -0.0982601 0.0577542 0.0509516 -0.0106525 0.0783524 -0.0077107 0.0467693 -0.0283771 0.1423333 -0.0891244 0.0114342 0.0406316 0.0855983 0.0665791 -0.0224461 0.0446599 -0.0179096 0.1442748 0.0676684 0.0576846 0.0245898 0.0713677 -0.1070937 -0.0416454 0.0241493 -0.0407601 0.1494828 -0.0226865 -0.1076959 0.0108378 -0.1215705 -0.0270435 0.0001077 0.0210676 0.0040286 0.1582346 unknown
polarizability: 198.8370645|10.422455|199.9176058|-0.6623567|-2.2738809|87.9917163 unknown
InChI: InChI=1S/C12H10S2/c1-3-9-4-2-6-11-8-14-13-7-10(5-1)12(9)11/h1-6H,7-8H2
charge 0 multiplicity 1
24 atoms
S  3.475156 0.533929 0.325045
S  2.550263 -1.387487 1.18804
C  -0.238133 0.01682 -0.197068
C  0.674979 1.140757 -0.338869
C  0.129284 -1.38939 -0.29844
C  -1.632425 0.324145 0.098393
C  2.076067 1.01356 -0.888557
C  1.556538 -1.901706 -0.356255
C  0.220041 2.443988 -0.076041
C  -0.872174 -2.371469 -0.220446
C  -2.046568 1.675938 0.332984
C  -2.611781 -0.721699 0.166617
C  -1.129353 2.722054 0.279819
C  -2.245668 -2.050686 -0.016958
H  2.128868 0.313674 -1.735357
H  2.437058 1.993236 -1.249767
H  1.566792 -3.004252 -0.33661
H  2.145945 -1.588458 -1.230759
H  0.926715 3.276615 -0.173556
H  -0.581527 -3.42679 -0.288106
H  -3.101351 1.868455 0.561487
H  -3.652936 -0.45146 0.378026
H  -1.441169 3.752908 0.476791
H  -2.99122 -2.851181 0.029787
