program: Gaussian 09
title: 000144733
version: EM64L-G09RevD.01
frameworkgroup: C1[X(C11H16S2)]
method: RPBEPBE
basis: SDD
operation: Freq
keyword: #pfreq=noraman
keyword: PBEPBE/SDD
title: #p freq=noraman PBEPBE/SDD
converged: NO YES NO NO
title: Mulliken charges:
elementType: S S C C C C C C C C C C C H H H H H H H H H H H H H H H H
charge: 0.071044 0.070827 -0.218839 -0.218973 0.328861 0.328560 -0.579155 -0.383013 -0.383188 -0.711618 -0.722996 -0.723104 -0.711660 0.288787 0.288758 0.253408 0.253459 0.223273 0.220470 0.243967 0.235815 0.240017 0.220842 0.220903 0.235960 0.239994 0.243821 0.220518 0.223262
chargesum: 0.00000
title: Mulliken charges with hydrogens summed into heavy atoms:
elementType: S S C C C C C C C C C C C
charge: 0.071044 0.070827 0.069947 0.069785 0.328861 0.328560 -0.072288 -0.383013 -0.383188 -0.023536 -0.026549 -0.026777 -0.023673
polarizability: 1.72792338e+02 -1.26891950e+01 1.39201469e+02 5.76645905e-03 -2.47457129e-02 1.20082845e+02
1716.lowfreq: -11.5566 -0.0031 -0.0006 0.0009 3.3095 12.2120 69.5120 93.6851 144.5212
frequency: 69.5107 93.5829 144.5194 163.2069 187.0523 193.3702 193.7434 216.4201 226.8908 240.5081 259.2071 301.7717 302.7763 342.9484 355.8911 384.8642 427.0719 455.6352 479.1780 541.2617 585.7568 656.1714 677.6780 681.8969 744.3274 811.2141 814.0016 902.5899 926.8530 930.9861 942.1736 947.5693 955.7972 961.9265 992.2052 999.2980 1011.2443 1051.7959 1104.1656 1107.1778 1135.4913 1142.1511 1157.8451 1164.1002 1174.6883 1177.4344 1190.4888 1220.3942 1245.4764 1264.9535 1289.0437 1306.0860 1369.8355 1370.6218 1392.8794 1395.1513 1453.0894 1454.6665 1464.8212 1465.4893 1471.7887 1474.1244 1487.4958 1489.0859 1505.1629 2984.0915 2984.2218 2988.9264 2989.2623 3044.9961 3083.2721 3083.3743 3087.7591 3088.1026 3090.2739 3091.8928 3094.6314 3098.6562 3100.0024 3101.7446 3109.6066
redmass: 8.7989 4.4392 3.6882 1.4055 1.1932 2.1176 2.1311 2.2235 2.2158 1.2277 1.3507 3.2577 3.1541 2.7093 5.5029 2.5754 3.0683 2.3701 3.1507 5.1350 3.7875 3.2098 6.4168 5.1588 4.0135 3.0749 2.7871 2.3513 2.6986 2.2953 1.5768 1.5094 1.8558 1.7380 1.3041 1.4419 1.5301 1.8467 2.0568 2.5481 1.8995 1.4553 3.1658 2.4088 2.5591 2.5182 2.2614 2.6549 2.0718 1.6724 2.4394 2.2702 1.1746 1.1736 1.1988 1.1910 1.0500 1.0563 1.0474 1.0476 1.0561 1.0605 1.0591 1.0524 1.0811 1.0343 1.0343 1.0354 1.0355 1.0600 1.1005 1.1004 1.0989 1.0997 1.1006 1.0995 1.0890 1.0997 1.0948 1.0971 1.1044
irintensity: 2.3461 1.2637 0.0910 0.0259 0.0383 0.6758 1.1367 0.0514 2.0658 0.1866 0.0791 0.6120 0.7582 2.2254 0.0491 0.4114 0.2883 0.4977 0.0002 1.3328 0.1258 0.2830 5.0012 5.4936 0.5741 3.2428 8.2692 0.8487 5.2539 0.1991 1.1596 3.6975 36.0385 3.1458 3.6462 0.0511 0.8377 73.1561 2.6659 29.2436 26.0663 0.0059 4.3036 73.5881 14.8777 0.0383 0.9821 11.4254 0.0072 14.3400 18.1279 41.9433 4.6992 15.9559 24.2480 13.4528 5.4444 10.2460 0.1961 1.7972 7.3892 0.4073 33.1588 4.1832 28.9079 32.9970 16.9691 26.4253 14.3215 23.4566 0.2928 2.5582 32.9009 0.5706 4.1515 41.7203 33.6052 52.3842 6.9627 4.4247 17.1156
temp: 298.150 k
press: 1.00000 atm
elementType: 16 16 6 6 6 6 6 6 6 6 6 6 6 1 1 1 1 1 1 1 1 1 1 1 1 1 1 1 1
symmnumber: 1
zpe: 632031.5 jmol-1
zpe.correction: 0.240728 hartree
zpe.thermalcorrener: 0.254576 hartree
zpe.thermalcorrenthalpy: 0.255520 hartree
zpe.thermalcorrgfe: 0.201437 hartree
zpe.sumelectzpe: -1223.867621 hartree
zpe.sumelectthermal: -1223.853773 hartree
zpe.sumelectthermalent: -1223.852829 hartree
zpe.sumelectthermalfe: -1223.906912 hartree
dipole: 0.0002 -0.0047 2.2081
dipole: 2.2081
quadrupole: -105.3609 -93.5442 -91.2755
quadrupole: 10.0825 0.0226 -0.0059
quadrupole: -8.6340 3.1827 5.4514 10.0825 0.0226 -0.0059
hfenergy: -1224.108349 hartree
pointgroup: C01 [X(C11H16S2)]
dipole: -0.0007423 0.0002162 0.8687262 debye
polarizability: 159.1589848|-20.8110808|152.8345295|0.0480917|-0.1018634|120.0831383 unknown
InChI: InChI=1S/C11H16S2/c1-10(2)6-5-7(8(10)12)11(3,4)9(6)13/h6-7H,5H2,1-4H3
charge 0 multiplicity 1
29 atoms
S  -1.996866 2.174833 -0.744685
S  2.001217 -2.175611 -0.73723
C  0.183732 1.132347 0.787064
C  -0.183951 -1.132043 0.787144
C  1.407623 0.555528 -0.060497
C  -1.408259 -0.555439 -0.059914
C  0.000291 0.000199 1.851129
C  -1.086897 0.958705 -0.027815
C  1.085518 -0.958446 -0.029465
C  2.750991 0.837816 0.676915
C  -1.523937 -1.116569 -1.499021
C  1.52359 1.117609 -1.499196
C  -2.751432 -0.839062 0.677316
H  0.35264 2.159075 1.140755
H  -0.352455 -2.158764 1.141055
H  0.883828 -0.141962 2.493436
H  -0.882699 0.142463 2.49416
H  2.740654 0.506737 1.729144
H  -1.722531 -2.203357 -1.465785
H  3.565598 0.299992 0.160185
H  2.359096 0.6181 -2.020639
H  -0.604826 -0.962408 -2.087588
H  2.967409 1.921212 0.652398
H  -2.96717 -1.922578 0.65203
H  -2.359869 -0.617282 -2.019999
H  0.60429 0.964554 -2.08777
H  -3.566354 -0.301369 0.160955
H  1.722971 2.20423 -1.465154
H  -2.741303 -0.508711 1.729771
