program: Gaussian 09
title: 000144730
version: EM64L-G09RevD.01
frameworkgroup: C1[X(C5H3NO3S)]
method: RPBEPBE
basis: SDD
operation: Freq
keyword: #p
keyword: freq=noraman
keyword: PBEPBE/SDD
title: #p freq=noraman PBEPBE/SDD
converged: NO NO NO NO
title: Mulliken charges:
elementType: S O O O N C C C C C H H H
charge: 0.424075 -0.187850 -0.202625 -0.184773 0.084258 0.507899 -0.285685 -0.101472 -0.688507 -0.167972 0.328907 0.296005 0.177741
chargesum: 0.00000
title: Mulliken charges with hydrogens summed into heavy atoms:
elementType: S O O O N C C C C C
charge: 0.424075 -0.187850 -0.202625 -0.184773 0.084258 0.507899 0.043221 -0.101472 -0.392502 0.009769
polarizability: 1.33958553e+02 3.87164729e+00 1.04363255e+02 2.71316365e-03 -3.72533423e-03 3.20425014e+01
1716.lowfreq: -7.0966 -4.1992 -0.0021 -0.0019 -0.0013 12.7100 73.4872 126.2434 126.5449
frequency: 73.4018 126.2431 126.5437 157.2157 218.0252 287.5821 364.2233 414.7425 434.7332 453.8372 593.1423 633.0718 680.5413 715.1614 718.9161 785.9778 807.2853 926.8049 950.3342 984.5470 1027.5454 1154.8361 1182.7659 1217.8075 1356.7411 1365.3844 1409.2591 1458.6004 1534.0511 1611.7214 2897.4365 3207.2149 3214.4328
redmass: 15.0348 12.2145 7.6001 4.1732 9.6599 3.1002 11.3194 9.5188 5.8579 14.5930 2.8938 9.1201 9.8443 8.2005 6.1686 1.3193 5.1534 1.3714 4.5028 1.8162 4.2170 1.6805 1.3535 10.1123 11.6254 1.5712 3.7412 6.0227 6.9200 7.3841 1.0860 1.0960 1.0955
irintensity: 2.0855 5.5422 7.1419 0.5409 3.8947 7.7397 4.6742 1.8865 0.4231 1.3654 17.3575 22.7080 6.4788 8.3856 27.6894 45.3464 16.2346 17.0664 3.7264 12.6926 29.1060 113.5538 52.2249 233.3029 105.2671 13.4476 14.1501 24.7318 56.2469 226.3271 105.7360 16.1543 1.9001
temp: 298.150 k
press: 1.00000 atm
elementType: 16 8 8 8 7 6 6 6 6 6 1 1 1
symmnumber: 1
zpe: 197922.9 jmol-1
zpe.correction: 0.075385 hartree
zpe.thermalcorrener: 0.084208 hartree
zpe.thermalcorrenthalpy: 0.085153 hartree
zpe.thermalcorrgfe: 0.040537 hartree
zpe.sumelectzpe: -869.976226 hartree
zpe.sumelectthermal: -869.967402 hartree
zpe.sumelectthermalent: -869.966458 hartree
zpe.sumelectthermalfe: -870.011073 hartree
dipole: -2.7948 4.4278 -0.0020
dipole: 5.2360
quadrupole: -79.2943 -64.6200 -63.5087
quadrupole: -7.5575 -0.0030 0.0032
quadrupole: -10.1533 4.5210 5.6323 -7.5575 -0.0030 0.0032
hfenergy: -870.0516104 hartree
pointgroup: C01 [X(C5H3N1O3S1)]
dipole: 1.1582746 1.7035333 0.0007777 debye
dipolederiv: -0.1693806 0.2257062 0.0000345 0.0606009 0.0382854 0.0000142 0.0000941 0.000014 0.2305823 -0.5348509 -0.149772 -0.0000586 -0.2440913 -0.78786 0.0002378 -0.000138 -0.0004091 -0.212958 -0.7979348 0.1087058 0.0001193 0.0975316 -0.5102311 -0.0001748 -0.0002974 0.0002055 -0.2213709 -0.7341659 0.177022 -0.0000225 0.5401216 -0.7416916 0.0001295 0.0001788 -0.0001558 -0.3243048 1.7120414 0.2814035 0.0001166 0.3296798 1.1059722 -0.0000139 0.0000629 0.0000366 0.2273288 -0.786075 0.1874471 0.0000623 0.0750703 -0.4385078 0.0000002 -0.0000266 0.0000433 0.0328394 0.3413201 0.2360653 0.0000077 0.0508751 -0.1383544 -0.000046 0.0000693 0.0000649 -0.0408811 -0.8577313 -0.2636571 -0.0001374 0.034879 0.3007106 -0.0000272 0.0002042 0.0000787 -0.1035162 0.2043461 -0.3552258 -0.0000646 -0.2772691 0.2229726 -0.0000238 -0.0000401 0.0000394 -0.2578117 1.5308182 -0.338721 -0.0001343 -0.4099757 0.87974 -0.0001962 -0.0003187 -0.0000744 0.1422547 0.1448465 0.0119599 -0.0000014 -0.0321826 0.1123203 0.0000072 0.0000108 0.0000066 0.2053011 0.0485458 -0.0483866 0.0000181 -0.0084224 0.091298 0.0000127 -0.0000178 -0.0000022 0.208049 -0.1017793 -0.0725473 0.0000603 -0.216817 -0.1346542 0.0000803 0.0002186 0.0001525 0.1144873 unknown
polarizability: 133.6604589|-4.8706225|104.6613483|0.0028385|0.0036307|32.0425014 unknown
InChI: InChI=1S/C5H3NO3S/c7-2-4-1-5(6(8)9)10-3-4/h1-3H
charge 0 multiplicity 1
13 atoms
S  -0.652352 1.898703 0.000097
O  -2.280712 -1.762275 -0.000477
O  -3.18326 0.352025 -0.000513
O  3.24525 -1.349129 -0.000391
N  -2.184037 -0.474568 0.000389
C  1.479742 0.302607 0.000103
C  0.347335 -0.590511 0.000175
C  -0.851459 0.09683 0.000234
C  1.109203 1.651646 -0.000018
C  2.893558 -0.141222 0.000133
H  0.432244 -1.678884 0.000251
H  1.767779 2.52113 -0.000107
H  3.64631 0.685246 -0.000577
