program: Gaussian 09
title: 000144722
version: EM64L-G09RevD.01
frameworkgroup: C1[X(C6F4N2S)]
method: RPBEPBE
basis: SDD
operation: Freq
keyword: #pfreq=noraman
keyword: PBEPBE/SDD
title: #p freq=noraman PBEPBE/SDD
converged: NO NO NO YES
title: Mulliken charges:
elementType: S F F F F N N C C C C C C
charge: 0.582247 -0.132228 -0.132226 -0.137795 -0.137798 -0.366979 -0.366994 0.095372 0.095389 0.143478 0.143475 0.107028 0.107031
chargesum: 0.00000
title: Mulliken charges with hydrogens summed into heavy atoms:
polarizability: 1.50071742e+02 -9.57230328e-05 1.04060491e+02 -2.18178980e-03 3.20860532e-04 3.68691962e+01
1716.lowfreq: -11.0193 -1.6614 0.0009 0.0021 0.0023 4.2580 97.0949 123.6681 164.8559
frequency: 97.0937 123.6666 164.8556 191.3330 219.2033 261.3728 273.4250 279.4323 340.6456 384.2093 398.8610 426.1404 450.8725 468.4929 530.5496 630.2791 632.6670 655.7232 667.7034 711.0384 725.8796 767.8245 945.5320 974.4073 1107.5552 1134.2844 1261.3641 1313.0435 1362.9442 1456.7689 1472.8320 1557.2224 1635.1082
redmass: 19.1190 16.9731 15.1947 15.5688 19.4584 18.8835 18.5844 18.2295 13.9153 17.7132 12.5455 14.8802 13.6489 18.4261 16.4356 12.1652 15.5952 12.1996 17.1119 14.1167 12.0901 12.6260 13.9814 13.5786 13.1849 13.2016 12.4281 12.5876 12.4054 12.1411 12.2900 12.1295 12.0430
irintensity: 0.0286 0.0000 0.6055 0.0000 1.8891 0.3388 1.7341 0.5261 7.3944 0.9714 0.0000 2.1603 9.0951 0.6207 0.9882 0.0739 6.0852 0.0000 6.6653 26.2664 0.0000 4.7875 106.2683 81.9097 0.0624 7.3435 1.2701 115.7502 159.6418 70.0787 108.5976 6.8057 31.5540
temp: 298.150 k
press: 1.00000 atm
elementType: 16 9 9 9 9 7 7 6 6 6 6 6 6
symmnumber: 1
zpe: 141292.9 jmol-1
zpe.correction: 0.053816 hartree
zpe.thermalcorrener: 0.064207 hartree
zpe.thermalcorrenthalpy: 0.065151 hartree
zpe.thermalcorrgfe: 0.017408 hartree
zpe.sumelectzpe: -1134.575349 hartree
zpe.sumelectthermal: -1134.564958 hartree
zpe.sumelectthermalent: -1134.564014 hartree
zpe.sumelectthermalfe: -1134.611756 hartree
dipole: 1.4588 0.0000 -0.0003
dipole: 1.4588
quadrupole: -79.0046 -91.6926 -75.1460
quadrupole: -0.0001 -0.0014 -0.0002
quadrupole: 2.9431 -9.7449 6.8018 -0.0001 -0.0014 -0.0002
hfenergy: -1134.6291648 hartree
pointgroup: C01 [X(C6F4N2S1)]
dipole: -0.5739461 0.0000175 -0.0001376 debye
dipolederiv: -0.066859 0.0000163 -0.0000036 -0.000019 0.2993228 0.0000034 -0.0001624 -0.0000021 0.3126971 -0.1740243 0.0345701 0.0000003 0.1099211 -0.9637944 0.0000178 -0.0000022 0.0000295 -0.0739989 -0.1740244 -0.034572 0.0000014 -0.1099242 -0.9637977 -0.0000301 0.0000054 0.0000183 -0.0739971 -0.933532 0.2457844 -0.0000048 0.4233367 -0.2805329 0.0000041 0.0000127 -0.0000019 -0.0828769 -0.9335314 -0.2457804 0.0000435 -0.4233323 -0.2805315 0.0000243 0.0000105 0.0000066 -0.0828785 0.0861397 0.0274207 0.0000458 -0.3383976 -0.1380801 -0.0000651 0.0001428 0.0000042 -0.2592914 0.0861654 -0.0274345 0.0000437 0.3384149 -0.1381056 0.0000603 0.0001305 -0.0000022 -0.2592942 -0.012377 0.138222 -0.0000409 -0.2223336 -0.208885 0.0000268 -0.0000528 0.0000265 0.0884332 -0.0123923 -0.1382218 -0.0000475 0.2223361 -0.2088699 -0.0000116 -0.0000707 -0.0000167 0.0884359 0.128092 -0.0795372 0.0000136 -0.1710487 1.1562331 -0.0000372 -0.0000211 -0.000052 0.0964143 0.1281054 0.0795314 0.0000098 0.171049 1.1562345 0.0000299 -0.0000011 -0.0000078 0.0964156 0.9391236 -0.4233706 -0.0000075 -0.6483369 0.2854107 -0.0000068 0.0000126 0.000033 0.0749713 0.9391142 0.4233717 -0.000054 0.6483347 0.285396 -0.0000157 -0.0000042 -0.0000354 0.0749695 unknown
polarizability: 150.0717418|-0.0003582|104.060491|0.0021818|-0.0003209|36.8691962 unknown
InChI: InChI=1S/C6F4N2S/c7-1-2(8)4(10)6-5(3(1)9)11-13-12-6
charge 0 multiplicity 1
13 atoms
S  -3.354241 0.000044 -0.000203
F  0.321121 -2.83037 0.000061
F  0.321131 2.830412 0.00003
F  2.70747 -1.364251 -0.000027
F  2.707476 1.364287 -0.000129
N  -2.178719 -1.329029 0.000055
N  -2.178719 1.329074 0.000037
C  -0.951404 -0.741931 0.000057
C  -0.9514 0.741978 0.00007
C  0.298383 -1.445726 0.00002
C  0.298389 1.445772 0.000026
C  1.480206 -0.720957 -0.000019
C  1.480206 0.720997 -0.000079
