program: Gaussian 09
title: 000144715
version: EM64L-G09RevD.01
frameworkgroup: C1[X(C19H20O2)]
method: RPBEPBE
basis: SDD
operation: Freq
keyword: #pfreq=noraman
keyword: PBEPBE/SDD
title: #p freq=noraman PBEPBE/SDD
converged: NO YES NO NO
title: Mulliken charges:
elementType: O O C C C C C C C C C C C C C C C C C C C H H H H H H H H H H H H H H H H H H H H
charge: -0.270855 -0.270911 -0.529186 -0.415218 -0.445885 -0.447895 0.363918 0.384369 0.506735 -0.428122 -0.309495 -0.308882 -0.851170 0.360242 0.354509 -0.433190 -0.431123 -0.251136 -0.249816 -0.523859 -0.524284 0.260003 0.262314 0.235571 0.227510 0.231311 0.219079 0.247081 0.220168 0.232065 0.226929 0.275023 0.275577 0.226791 0.226801 0.228826 0.216634 0.232011 0.227411 0.217030 0.233119
chargesum: 0.00000
title: Mulliken charges with hydrogens summed into heavy atoms:
elementType: O O C C C C C C C C C C C C C C C C C C C
charge: -0.270855 -0.270911 -0.269183 -0.152903 0.017197 0.002494 0.363918 0.384369 0.506735 -0.181041 -0.309495 -0.308882 -0.172008 0.360242 0.354509 -0.158168 -0.155547 -0.024345 -0.023015 0.153613 0.153276
polarizability: 2.82313737e+02 -3.55707568e+00 2.27814600e+02 -3.82252594e+00 -7.96336090e+00 1.29576325e+02
1716.lowfreq: -8.6251 -2.0000 -0.0006 -0.0006 0.0003 5.5142 53.6033 60.6860 69.8956
frequency: 53.5838 60.6854 69.8733 76.8098 84.9661 130.3943 130.9796 156.6677 163.1834 172.1446 186.3885 194.3025 199.5953 222.4240 251.7929 287.1401 288.4450 318.6380 333.3658 401.8343 417.0629 424.8626 459.0302 475.0598 509.5268 517.6260 535.4646 587.5778 609.1672 629.7145 642.8518 676.0879 697.4818 722.3418 754.0268 782.1378 787.4159 799.3882 825.1717 837.5670 840.1785 876.3734 896.5265 900.9245 909.5232 924.4055 939.7454 963.3650 972.7752 989.4035 994.0734 1024.0270 1028.0830 1040.2792 1044.8175 1061.1889 1075.1787 1105.1866 1112.5421 1112.6520 1135.0989 1147.4716 1151.8799 1152.9263 1167.0144 1169.1336 1171.9616 1222.8330 1232.2651 1252.1695 1262.5373 1274.1163 1282.8143 1301.9328 1318.6345 1327.3586 1337.9872 1381.2212 1394.2792 1418.5425 1428.0726 1434.5058 1438.0007 1446.3706 1456.4234 1457.9393 1459.0471 1461.6387 1466.1329 1472.9408 1474.2314 1476.8557 1506.6671 1585.4696 1607.8366 1629.4269 1664.2164 2951.2191 2952.3111 2954.1346 2992.4444 3009.0542 3023.0253 3036.5421 3037.5479 3049.2799 3063.9234 3073.7389 3075.4726 3076.1510 3110.3507 3111.0252 3125.8272 3141.3799 3145.0965 3155.1550 3165.4495
redmass: 3.9850 2.9521 2.9500 3.6203 3.1906 3.4296 3.2420 1.1144 1.0946 1.3640 2.0158 2.1826 3.0012 2.9950 5.0530 3.8188 5.0110 3.2950 5.7015 4.2197 4.9188 4.5196 3.9198 4.0723 4.4612 4.7669 4.9063 4.2373 5.3842 6.0478 4.8046 4.9086 3.6214 5.5179 3.9087 1.7490 2.1371 1.8938 1.8406 2.6173 2.6877 2.9596 2.6263 2.2602 7.2842 4.0861 5.3509 1.9328 1.3625 1.9621 1.3208 3.0632 2.4530 3.3348 1.6899 2.1903 5.1894 2.2574 1.2427 1.2576 1.1464 1.3414 1.3939 1.3900 1.1234 1.5686 1.6402 1.2380 1.3356 1.5740 1.7914 3.5866 1.4923 1.7985 1.8317 1.6528 2.3597 5.3322 1.2571 2.8682 5.6547 1.5219 1.3408 1.8501 1.0538 1.0545 1.0500 1.0796 1.0680 1.0657 1.0561 1.0925 3.9702 8.3060 7.2311 8.3205 6.4895 1.0317 1.0318 1.0377 1.0584 1.0618 1.0962 1.1035 1.1034 1.1038 1.0876 1.1053 1.0950 1.0901 1.1005 1.1006 1.0851 1.0889 1.0957 1.0947 1.1000
irintensity: 0.9821 5.7819 0.5596 3.1228 1.0188 0.1279 3.0524 0.0460 0.0215 0.3660 0.2749 0.6543 3.2467 0.0096 0.7723 6.9179 5.6926 4.0849 9.3364 0.6641 1.0937 3.4547 3.5443 0.2954 0.0577 0.4462 5.6818 1.0386 9.2494 2.1868 1.7408 1.8158 18.6040 6.4178 4.6137 57.7187 24.4857 11.5338 26.3350 0.9803 7.0373 6.0492 0.6449 0.2868 0.1522 3.1509 42.7597 0.6201 3.2086 12.7173 0.1195 10.1620 10.0058 113.6725 9.2344 19.8081 0.8421 0.3227 0.1005 0.0842 28.5167 0.7444 4.8416 3.1057 0.2551 1.0350 21.1309 3.6574 0.9876 1.9278 21.9588 4.0099 4.2741 63.5371 24.2589 20.3107 67.6890 1.3134 10.0015 0.8126 11.0719 2.8529 1.8532 14.3773 13.9045 9.0933 8.1128 4.5188 5.2464 2.6805 12.6106 8.2084 4.4387 1.7988 20.6492 3.7824 3.0553 88.2141 48.8456 34.8009 33.6423 65.9875 26.1668 34.3850 48.8846 2.0761 26.4363 55.7661 46.9808 7.4913 36.9256 28.0739 4.0965 9.6747 25.8546 15.9795 32.4295
temp: 298.150 k
press: 1.00000 atm
elementType: 8 8 6 6 6 6 6 6 6 6 6 6 6 6 6 6 6 6 6 6 6 1 1 1 1 1 1 1 1 1 1 1 1 1 1 1 1 1 1 1 1
symmnumber: 1
zpe: 885841.3 jmol-1
zpe.correction: 0.337399 hartree
zpe.thermalcorrener: 0.356402 hartree
zpe.thermalcorrenthalpy: 0.357346 hartree
zpe.thermalcorrgfe: 0.291000 hartree
zpe.sumelectzpe: -884.918644 hartree
zpe.sumelectthermal: -884.899641 hartree
zpe.sumelectthermalent: -884.898697 hartree
zpe.sumelectthermalfe: -884.965044 hartree
dipole: -1.2685 0.0004 0.3349
dipole: 1.3120
quadrupole: -113.0095 -108.9241 -128.7970
quadrupole: 2.1726 1.2253 8.2142
quadrupole: 3.9007 7.9861 -11.8868 2.1726 1.2253 8.2142
hfenergy: -885.2560432 hartree
pointgroup: C01 [X(C19H20O2)]
dipole: 0.4991964 -0.0266394 -0.1286038 debye
polarizability: 282.5568539|0.892194|227.9762983|-2.7157551|5.4190148|129.1715105 unknown
InChI: InChI=1S/C19H20O2/c1-11-10-12-8-9-13(11)17-16(12)18(20-2)14-6-4-5-7-15(14)19(17)21-3/h4-7,10,12-13H,8-9H2,1-3H3
charge 0 multiplicity 1
41 atoms
O  -0.164623 -2.707074 -0.743162
O  -0.819705 2.77468 0.660438
C  2.238446 -0.88368 -0.483644
C  1.942645 1.628677 0.138189
C  2.740921 0.015629 -1.682357
C  2.567332 1.52402 -1.310456
C  0.779793 -0.506154 -0.254278
C  0.614597 0.881415 0.077456
C  3.042925 -0.460917 0.754551
C  2.876686 0.854626 1.069969
C  -0.327174 -1.343178 -0.36543
C  -0.65567 1.408856 0.292222
C  3.913633 -1.457842 1.476061
C  -1.65852 -0.829589 -0.151876
C  -1.823976 0.56633 0.20171
C  -2.821652 -1.655799 -0.281478
C  -3.142143 1.067305 0.453952
C  -4.097072 -1.134885 -0.048178
C  -4.257754 0.234542 0.333459
C  -0.003894 -3.623082 0.402685
C  -0.989894 3.683855 -0.48891
H  2.350369 -1.952573 -0.728217
H  1.808019 2.676564 0.447814
H  2.160454 -0.240812 -2.586705
H  3.800769 -0.221976 -1.884648
H  3.540106 2.046951 -1.316008
H  1.905846 2.034644 -2.03506
H  3.37088 1.350138 1.911964
H  3.313502 -2.30481 1.866484
H  4.443854 -0.996917 2.327872
H  4.671571 -1.896929 0.796868
H  -2.685677 -2.697171 -0.589871
H  -3.248276 2.112365 0.761589
H  -4.980105 -1.774286 -0.157359
H  -5.261026 0.627815 0.531639
H  -0.884525 -3.58157 1.07327
H  0.904964 -3.37278 0.985898
H  0.093818 -4.631044 -0.029855
H  -1.867822 3.395042 -1.099711
H  -0.086787 3.685249 -1.131641
H  -1.143538 4.685864 -0.058846
