program: Gaussian 09
title: 000144714
version: EM64L-G09RevD.01
frameworkgroup: C1[X(C18H18O2)]
method: RPBEPBE
basis: SDD
operation: Freq
keyword: #pfreq=noraman
keyword: PBEPBE/SDD
title: #p freq=noraman PBEPBE/SDD
converged: NO YES NO NO
title: Mulliken charges:
elementType: O O C C C C C C C C C C C C C C C C C C H H H H H H H H H H H H H H H H H H
charge: -0.270212 -0.270211 -0.437107 -0.437113 -0.446602 -0.446600 0.383234 0.383240 -0.208254 -0.208256 -0.310302 -0.310308 0.358378 0.358370 -0.429791 -0.429788 -0.249265 -0.249263 -0.523753 -0.523753 0.265024 0.265022 0.219065 0.233884 0.233882 0.219067 0.237203 0.237204 0.275222 0.275223 0.227032 0.227032 0.234143 0.215538 0.226569 0.226568 0.215538 0.234143
chargesum: 0.00000
title: Mulliken charges with hydrogens summed into heavy atoms:
elementType: O O C C C C C C C C C C C C C C C C C C
charge: -0.270212 -0.270211 -0.172083 -0.172091 0.006347 0.006349 0.383234 0.383240 0.028949 0.028948 -0.310302 -0.310308 0.358378 0.358370 -0.154569 -0.154566 -0.022233 -0.022231 0.152497 0.152496
polarizability: 2.66628008e+02 4.92481198e-07 2.13723845e+02 9.71349543e-01 1.09298775e-04 1.19654306e+02
1716.lowfreq: -13.1840 -8.9074 -7.4347 -0.0003 -0.0001 0.0005 48.2814 51.8836 61.7437
frequency: 48.2746 51.8550 61.7430 82.3991 94.9142 128.1924 149.6964 150.0672 181.4194 186.8732 217.3734 233.7157 252.5238 266.3251 274.5754 322.7808 389.9293 409.5011 425.5662 470.7626 474.7883 492.1404 501.6350 551.4271 578.3991 619.0580 637.1734 645.1916 674.4978 690.7809 719.1634 742.1470 756.2857 784.0898 813.4075 822.2445 839.8197 856.8821 890.0666 902.1635 909.4488 926.1509 934.7453 940.5841 948.2223 968.3740 973.1708 995.2837 1021.3976 1025.2874 1027.1792 1054.2035 1075.6365 1105.7102 1110.1370 1110.6771 1113.5508 1135.3890 1149.0653 1150.2347 1158.7468 1166.7858 1170.2526 1217.3887 1225.4914 1258.3587 1271.5153 1273.9259 1290.3882 1295.6437 1320.9767 1325.7950 1339.6857 1379.5291 1417.2242 1426.5457 1432.7865 1436.1133 1445.5833 1455.6436 1456.1170 1461.2987 1471.2551 1472.0869 1477.0507 1506.1299 1584.6760 1607.7791 1619.8144 1629.5007 2949.6458 2950.3375 2989.3860 3005.7388 3035.1777 3035.3908 3047.4292 3071.5083 3076.1249 3079.5735 3109.7385 3109.9143 3126.2597 3139.6918 3141.8880 3155.7799 3165.9329 3171.8250
redmass: 2.7665 3.0645 3.8974 3.7402 3.2925 3.5158 1.0718 1.0408 4.2708 2.8608 2.5892 3.5897 4.8816 4.1695 4.2604 5.6861 4.5438 4.5523 3.0935 4.7734 5.0837 4.2917 4.2388 5.7501 4.1411 7.0056 6.5869 4.5435 4.0337 2.6511 2.1358 5.1741 4.8472 1.4952 1.4091 3.7356 2.7067 2.9955 3.2499 2.0138 7.7102 3.8202 1.5246 5.8117 2.6314 1.9926 1.3651 1.3099 3.4707 3.8775 2.4580 3.0546 5.2088 2.0811 1.2388 1.3044 1.0830 1.1241 1.3882 1.4067 1.1449 1.0899 1.6302 1.2784 1.2882 1.6892 2.0529 2.7472 1.2826 1.9761 1.4384 1.9296 2.0665 5.1992 2.7514 5.5813 1.4348 1.3852 2.0019 1.0568 1.0539 1.0838 1.0642 1.0551 1.0955 3.9938 8.2146 7.2648 6.0251 8.2859 1.0317 1.0318 1.0590 1.0620 1.1035 1.1035 1.1035 1.1050 1.0868 1.0883 1.1004 1.1004 1.0851 1.0863 1.0889 1.0946 1.1000 1.1060
irintensity: 0.0100 5.9076 2.4622 1.3173 0.5578 1.4878 0.0316 0.0554 0.3501 0.0125 3.3818 5.2261 4.1784 4.7652 3.5440 8.2354 0.3718 5.1422 1.0116 0.2066 1.2736 1.2961 3.0871 1.9473 1.8899 8.3958 0.4437 1.3359 9.9357 9.5851 62.0700 5.7462 2.9097 78.9299 12.3566 13.6547 1.9429 2.4920 1.9396 1.4094 36.1758 0.0203 2.7678 16.7803 0.2341 0.1747 2.6996 0.1733 6.1153 53.1169 4.9671 75.6066 25.0409 0.0125 0.1358 0.0030 6.1361 17.6181 2.8408 5.7866 5.1175 1.1631 15.2760 4.0717 0.0012 18.2312 1.8341 7.5157 1.6523 76.6963 2.1382 31.1982 74.4805 1.3238 0.7816 10.6055 2.1560 6.0829 11.3288 0.2880 18.2407 2.2233 1.3287 11.6036 7.7036 5.3052 4.0258 20.6593 3.2023 2.9240 34.8464 90.6425 32.6326 68.6603 0.1994 83.7592 0.0905 66.4440 34.7327 10.3447 61.0164 3.4744 4.0981 5.2569 9.9949 15.5635 34.1478 36.8014
temp: 298.150 k
press: 1.00000 atm
elementType: 8 8 6 6 6 6 6 6 6 6 6 6 6 6 6 6 6 6 6 6 1 1 1 1 1 1 1 1 1 1 1 1 1 1 1 1 1 1
symmnumber: 1
zpe: 813578.6 jmol-1
zpe.correction: 0.309876 hartree
zpe.thermalcorrener: 0.327267 hartree
zpe.thermalcorrenthalpy: 0.328211 hartree
zpe.thermalcorrgfe: 0.264886 hartree
zpe.sumelectzpe: -845.686568 hartree
zpe.sumelectthermal: -845.669177 hartree
zpe.sumelectthermalent: -845.668233 hartree
zpe.sumelectthermalfe: -845.731559 hartree
dipole: -1.0981 0.0000 3.4564
dipole: 3.6266
quadrupole: -107.4819 -107.4167 -118.0963
quadrupole: -0.0004 1.6695 0.0001
quadrupole: 3.5164 3.5816 -7.0980 -0.0004 1.6695 0.0001
hfenergy: -845.9964441 hartree
pointgroup: C01[X(C18H18O2)]
dipole: -0.4195328 -0.0000583 -1.3637424 debye
polarizability: 266.6334649|0.0000676|213.7238451|0.3760335|-0.0042082|119.6488484 unknown
InChI: InChI=1S/C18H18O2/c1-19-17-13-5-3-4-6-14(13)18(20-2)16-12-9-7-11(8-10-12)15(16)17/h3-7,9,11-12H,8,10H2,1-2H3
charge 0 multiplicity 1
38 atoms
O  0.299093 2.848053 0.12122
O  0.299045 -2.848072 0.121481
C  -2.30831 1.30636 0.155265
C  -2.308342 -1.306324 0.155366
C  -3.034841 0.782136 -1.148472
C  -3.034852 -0.782185 -1.148417
C  -0.901143 0.718172 0.128166
C  -0.901157 -0.718165 0.12824
C  -3.047458 0.680505 1.339032
C  -3.047501 -0.680358 1.339069
C  0.29848 1.42441 0.101772
C  0.29845 -1.424433 0.101911
C  1.560277 0.724737 0.127859
C  1.560262 -0.72478 0.127926
C  2.81196 1.419646 0.175495
C  2.81193 -1.419712 0.175623
C  4.018416 0.71526 0.204617
C  4.018401 -0.71535 0.204683
C  0.306616 3.460754 -1.220271
C  0.30645 -3.460888 -1.219956
H  -2.290397 2.406315 0.195019
H  -2.290457 -2.406276 0.195209
H  -2.512155 1.176407 -2.039763
H  -4.066539 1.175754 -1.162282
H  -4.066556 -1.175788 -1.162194
H  -2.51217 -1.176532 -2.039677
H  -3.529382 1.30322 2.098989
H  -3.529453 -1.303009 2.099061
H  2.795592 2.513277 0.217243
H  2.795534 -2.513339 0.217465
H  4.969989 1.256852 0.245493
H  4.969962 -1.256959 0.245612
H  0.34248 4.548704 -1.053956
H  -0.611673 3.196786 -1.782463
H  1.192463 3.137714 -1.801916
H  1.192247 -3.137898 -1.801705
H  -0.611888 -3.196971 -1.782093
H  0.342329 -4.548824 -1.053551
