program: Gaussian 09
title: 000144713
version: EM64L-G09RevD.01
frameworkgroup: C1[X(C17H18O2)]
method: RPBEPBE
basis: SDD
operation: Freq
keyword: #pfreq=noraman
keyword: PBEPBE/SDD
title: #p freq=noraman PBEPBE/SDD
converged: YES YES NO NO
title: Mulliken charges:
elementType: O O C C C C C C C C C C C C C C C C C H H H H H H H H H H H H H H H H H H
charge: -0.273048 -0.273049 -0.348209 -0.348204 -0.519441 -0.461718 -0.461720 0.336506 0.336507 -0.267636 -0.267614 0.318467 0.318455 -0.423175 -0.423177 -0.243401 -0.243398 -0.523639 -0.523637 0.267785 0.267780 0.257073 0.221492 0.219394 0.235468 0.235467 0.219398 0.277305 0.277306 0.225576 0.225576 0.225693 0.221117 0.233945 0.221116 0.225696 0.233946
chargesum: 0.00000
title: Mulliken charges with hydrogens summed into heavy atoms:
elementType: O O C C C C C C C C C C C C C C C C C
charge: -0.273048 -0.273049 -0.080425 -0.080424 -0.040877 -0.006856 -0.006855 0.336506 0.336507 -0.267636 -0.267614 0.318467 0.318455 -0.145871 -0.145871 -0.017824 -0.017822 0.157116 0.157120
polarizability: 2.60479804e+02 3.15837416e-04 2.06447256e+02 3.78385076e+00 3.76001919e-04 1.10285957e+02
1716.lowfreq: -9.8442 -0.0008 -0.0007 -0.0004 3.5030 3.6066 49.2766 60.6117 62.5507
frequency: 49.2066 60.5966 62.5477 93.5355 109.2679 128.7038 146.7005 148.5509 192.1099 192.7478 231.5425 250.6708 260.6822 263.1823 292.2721 353.3253 409.1052 447.6700 459.6676 476.3634 494.0396 527.4382 549.4559 597.2559 632.0993 636.2307 677.1791 689.0936 749.2052 778.6671 785.9114 808.0666 816.6412 827.8810 864.6852 874.1246 895.2400 900.6260 911.8925 919.2079 933.3578 951.4928 960.6389 977.7095 990.5296 997.9253 1026.2656 1035.2008 1045.1206 1073.5453 1089.0827 1108.7288 1110.1285 1112.9927 1120.7259 1145.7661 1152.4866 1158.0387 1165.7468 1167.8857 1171.1362 1210.5233 1250.6147 1261.6206 1262.2997 1268.0182 1272.5146 1295.8614 1301.1149 1331.4615 1366.4291 1411.5471 1433.8492 1434.5821 1438.8525 1447.2493 1459.8100 1459.9816 1464.9729 1467.6943 1472.0209 1472.7239 1488.2678 1508.7240 1590.0993 1612.3374 1634.7640 2958.2595 2959.0340 2998.9883 3010.4262 3014.8480 3045.9154 3046.1820 3057.9566 3080.1900 3086.3935 3090.0856 3094.9880 3110.6457 3110.7858 3125.9653 3144.0698 3161.4924 3169.1784
redmass: 2.5538 3.0182 3.7648 2.4604 2.6031 2.3216 1.2423 1.5005 2.7192 4.2060 4.7933 5.0943 2.3494 4.1888 4.7505 4.4208 4.4468 5.5637 3.2149 4.6097 2.8049 3.9591 4.3999 5.2579 6.1131 5.8217 6.2673 3.8076 5.0293 3.2785 1.6055 1.4857 4.3945 3.2640 2.4945 2.6265 4.6782 1.8074 3.1179 4.4977 5.2206 2.6957 2.2268 1.3652 2.3409 1.3133 2.0987 1.8422 1.9818 2.3709 4.0292 1.2415 1.2778 1.1507 1.3170 1.5215 1.4575 1.6151 1.0958 1.5976 1.3665 1.2267 1.4720 3.4729 1.5383 1.4865 1.8550 1.4813 1.6757 2.9351 4.4971 3.6586 1.4929 2.7247 1.6214 1.9110 1.0607 1.0580 1.0857 1.0937 1.0571 1.0558 1.1236 4.2573 8.8492 6.7784 9.5755 1.0315 1.0316 1.0591 1.0604 1.0620 1.1033 1.1033 1.1041 1.1049 1.0881 1.1032 1.0952 1.1006 1.1006 1.0855 1.0901 1.0942 1.0990
irintensity: 2.1714 4.2508 5.1635 1.4527 1.6446 0.2453 0.8581 0.1371 0.9419 0.3549 12.2169 4.0171 0.1263 1.0041 3.7840 3.1052 5.0305 0.4329 0.7928 5.4481 0.8559 1.8624 1.3348 7.8921 0.0034 5.3758 1.0878 16.5526 3.5258 11.8902 72.4333 4.1973 0.7938 5.1244 4.6103 2.4711 7.8026 1.2272 20.5533 0.8203 14.6693 4.9770 7.0126 2.9469 51.2542 0.0486 8.7273 0.2808 43.4258 63.8285 19.3935 3.6540 1.1936 19.6508 1.9551 0.0108 9.9460 12.8263 0.9072 30.4522 0.9622 0.3114 1.1275 0.4211 11.9359 9.0216 12.8051 3.1969 52.9450 159.0376 4.4415 1.1761 1.3336 3.7926 8.8944 15.2230 0.2876 19.8609 0.1934 11.6414 1.3946 21.2936 8.7840 1.0665 1.4008 21.7594 11.3460 52.0486 82.9427 31.8259 46.6088 82.0607 0.1073 79.8308 2.9316 42.6724 48.7854 70.8537 9.9140 52.5597 5.5023 6.7992 16.3509 9.9267 28.6380
temp: 298.150 k
press: 1.00000 atm
elementType: 8 8 6 6 6 6 6 6 6 6 6 6 6 6 6 6 6 6 6 1 1 1 1 1 1 1 1 1 1 1 1 1 1 1 1 1 1
symmnumber: 1
zpe: 801146.5 jmol-1
zpe.correction: 0.305141 hartree
zpe.thermalcorrener: 0.321750 hartree
zpe.thermalcorrenthalpy: 0.322694 hartree
zpe.thermalcorrgfe: 0.261100 hartree
zpe.sumelectzpe: -807.651860 hartree
zpe.sumelectthermal: -807.635251 hartree
zpe.sumelectthermalent: -807.634307 hartree
zpe.sumelectthermalfe: -807.695901 hartree
dipole: -2.7883 0.0001 2.7708
dipole: 3.9309
quadrupole: -101.7271 -102.4621 -114.3108
quadrupole: -0.0007 1.3894 -0.0004
quadrupole: 4.4396 3.7045 -8.1441 -0.0007 1.3894 -0.0004
hfenergy: -807.9570008 hartree
pointgroup: C01 [X(C17H18O2)]
dipole: 1.0703076 -0.0003069 1.1163465 debye
polarizability: 260.5749252|-0.0136618|206.4472597|-0.1461993|0.0004287|110.1908322 unknown
InChI: InChI=1S/C17H18O2/c1-18-16-12-5-3-4-6-13(12)17(19-2)15-11-8-7-10(9-11)14(15)16/h3-6,10-11H,7-9H2,1-2H3
charge 0 multiplicity 1
37 atoms
O  -0.316145 2.855518 -0.187048
O  -0.317546 -2.855397 -0.18704
C  2.382446 1.147863 -0.354969
C  2.381908 -1.149024 -0.354964
C  2.922015 -0.000709 -1.270217
C  3.097211 0.786939 1.001452
C  3.096836 -0.788429 1.001457
C  0.921958 0.720495 -0.225494
C  0.921617 -0.720977 -0.225492
C  -0.265728 1.437184 -0.137128
C  -0.266419 -1.43709 -0.137126
C  -1.523526 0.7262 -0.088408
C  -1.523874 -0.725495 -0.088409
C  -2.775306 1.419923 -0.048422
C  -2.775993 -1.418609 -0.048424
C  -3.982056 0.715716 -0.000413
C  -3.982401 -0.713815 -0.000413
C  0.286027 3.548019 0.964297
C  0.284463 -3.548219 0.964195
H  2.547701 2.177665 -0.704205
H  2.54669 -2.178901 -0.7042
H  2.469911 -0.000605 -2.276258
H  4.024471 -0.000968 -1.35357
H  2.566407 1.20726 1.873242
H  4.127917 1.185852 1.005764
H  4.127352 -1.187835 1.005779
H  2.565826 -1.208491 1.873247
H  -2.757626 2.513554 -0.069098
H  -2.758847 -2.512248 -0.069097
H  -4.933272 1.25888 0.029879
H  -4.93388 -1.256519 0.029878
H  1.362176 3.311255 1.067434
H  -0.238939 3.279453 1.902055
H  0.16287 4.623295 0.761307
H  -0.240203 -3.279386 1.902043
H  1.360754 -3.312024 1.06715
H  0.160707 -4.623429 0.761216
