program: Gaussian 09
title: 000144707
version: EM64L-G09RevD.01
frameworkgroup: C1[X(C4H7N5)]
method: RPBEPBE
basis: SDD
operation: Freq
keyword: #p
keyword: freq=noraman
keyword: PBEPBE/SDD
title: #p freq=noraman PBEPBE/SDD
converged: YES YES NO NO
title: Mulliken charges:
elementType: N N N N N C C C C H H H H H H H
charge: -0.086533 -0.102183 -0.036250 -0.171209 -0.604753 -0.414851 -0.010509 0.135872 -0.538713 0.244467 0.234115 0.237992 0.337308 0.333421 0.223495 0.218333
chargesum: 0.00000
title: Mulliken charges with hydrogens summed into heavy atoms:
elementType: N N N N N C C C C
charge: -0.086533 -0.102183 -0.036250 -0.171209 0.065976 0.063730 0.227483 0.135872 -0.096886
polarizability: 1.06486531e+02 -5.30850121e+00 7.29679980e+01 6.78909673e+00 -4.77513199e+00 4.81486615e+01
1716.lowfreq: -7.4367 -0.0007 -0.0002 0.0009 3.1024 7.2225 34.1064 65.5050 109.7762
frequency: 34.0469 65.4921 109.7667 255.4486 279.8935 364.7208 369.0982 383.7800 388.5499 421.6217 569.4257 615.2154 708.2854 717.8886 792.7850 890.5199 923.3979 931.5368 959.9859 975.5996 1001.5605 1019.6907 1050.3087 1137.0127 1157.3435 1280.7095 1283.7991 1312.4811 1332.4664 1350.5928 1428.0658 1446.4792 1563.7933 1630.3003 1664.1549 3022.4083 3087.1766 3093.8319 3117.3651 3204.0280 3585.3428 3734.1797
redmass: 3.8441 3.4110 2.7532 3.1871 3.9014 2.1875 1.2896 4.4592 1.1189 2.6370 1.6969 8.2999 3.9936 10.0880 4.0222 1.9511 2.6477 4.7862 1.3270 3.1989 1.1585 2.9282 2.9114 8.2981 2.3925 1.3886 1.3864 5.7757 1.5346 2.2589 1.1732 1.0990 1.8270 2.2325 4.7037 1.0588 1.0998 1.0631 1.0963 1.1146 1.0445 1.1058
irintensity: 1.4422 1.0961 1.5858 9.8701 9.9939 21.0222 177.8682 2.0404 163.6493 1.6504 6.0672 2.2386 12.2988 6.8079 17.7427 21.7816 17.2611 28.2885 74.8743 12.5230 18.3952 5.9528 4.3574 51.7679 0.8612 1.5784 9.1980 15.9220 3.6692 6.4523 11.6593 18.9139 55.4310 424.4148 6.7243 16.2794 0.9933 10.7441 8.1773 21.0625 97.0330 55.4317
temp: 298.150 k
press: 1.00000 atm
elementType: 7 7 7 7 7 6 6 6 6 1 1 1 1 1 1 1
symmnumber: 1
zpe: 318566.4 jmol-1
zpe.correction: 0.121336 hartree
zpe.thermalcorrener: 0.130181 hartree
zpe.thermalcorrenthalpy: 0.131125 hartree
zpe.thermalcorrgfe: 0.086572 hartree
zpe.sumelectzpe: -429.629253 hartree
zpe.sumelectthermal: -429.620407 hartree
zpe.sumelectthermalent: -429.619463 hartree
zpe.sumelectthermalfe: -429.664017 hartree
dipole: 0.8727 -2.6279 0.6247
dipole: 2.8386
quadrupole: -40.6537 -55.8301 -52.0142
quadrupole: 8.6869 0.3495 1.8002
quadrupole: 8.8456 -6.3308 -2.5149 8.6869 0.3495 1.8002
hfenergy: -429.7505882 hartree
pointgroup: C01 [X(C4H7N5)]
dipole: 0.337968 -1.061674 0.076657 debye
dipolederiv: -0.5907179 0.2037629 -0.0500426 0.0719552 0.1474451 -0.0160022 -0.0948244 -0.0249859 -0.1281448 -0.4579026 -0.3222419 -0.0434879 0.4119236 -0.3515624 0.0890717 -0.0940363 -0.0667958 -0.1744864 0.5156068 -0.2749066 0.1399694 -0.2988596 -0.1921523 -0.0311785 0.1962151 -0.0630559 -0.1034778 -0.6967498 0.1458846 -0.071647 -0.6398933 -0.2351652 -0.1166595 -0.0960149 0.0420232 -0.2033464 -1.0393719 -0.4836201 -0.0031791 -0.6873699 -0.5265491 -0.1549083 -0.0160751 -0.1287475 -0.747232 0.7485432 -0.04692 0.0229474 0.1224852 0.1552092 -0.005722 0.0885168 0.0426438 0.2506187 -0.0915267 -0.155676 -0.101724 -0.1597365 -0.0465446 -0.0810708 -0.2035793 -0.0539184 0.0905728 1.1325419 0.7383232 0.1587095 0.9964606 0.5490569 0.1617043 0.1650781 0.1583586 0.2238476 -0.2928885 -0.1043467 -0.0729005 -0.1178641 -0.1897643 -0.1000663 -0.0108052 -0.1027501 0.0755889 0.0118238 0.0607009 0.0242102 -0.0338634 -0.0408425 -0.0692713 0.0332109 -0.0310529 0.099497 -0.0256579 0.0151822 -0.0198584 0.0372803 0.0583706 0.1277407 -0.0239118 0.0481974 -0.0348441 0.1163477 0.0676592 -0.0118044 0.0761094 0.0611427 0.08353 0.0449371 0.0562126 -0.0650623 0.2889541 0.0123111 -0.0350814 0.0009254 0.1666084 0.0176166 -0.031448 0.0205436 0.4012761 0.1848874 0.025854 -0.0579137 0.0617863 0.2262577 0.0232508 -0.0626347 0.016445 0.3987677 0.0559425 0.0741261 0.1027687 0.109023 0.1211644 -0.0081604 0.1196222 -0.0185062 -0.0170929 0.1401678 0.0439071 0.0190335 0.0496378 0.0973254 0.0801253 -0.0142505 0.1053885 -0.0664822 unknown
polarizability: 106.3950201|-6.4923125|73.9054827|5.9838965|-0.6213648|47.3026875 unknown
InChI: InChI=1S/C4H7N5/c1-2-3-9-7-4(5)6-8-9/h2H,1,3,5H2
charge 0 multiplicity 1
16 atoms
N  0.126788 0.386965 0.390903
N  -0.56572 -0.80873 0.300736
N  -0.637669 1.50744 0.117073
N  -1.884568 1.039604 -0.161938
N  -2.901688 -1.167401 -0.252758
C  1.562634 0.465377 0.707202
C  2.443636 0.020023 -0.444645
C  -1.815803 -0.356432 -0.04459
C  3.402276 -0.929954 -0.335462
H  1.745183 1.527053 0.952401
H  1.754355 -0.145366 1.605305
H  2.277599 0.538763 -1.39913
H  -3.790612 -0.744619 -0.499781
H  -2.81294 -2.17415 -0.166236
H  4.039831 -1.198433 -1.184601
H  3.576498 -1.468841 0.604123
