program: Gaussian 09
title: 000144701
version: EM64L-G09RevD.01
frameworkgroup: C1[X(C10H12)]
method: RPBEPBE
basis: SDD
operation: Freq
keyword: #p
keyword: freq=noraman
keyword: PBEPBE/SDD
title: #p freq=noraman PBEPBE/SDD
converged: NO YES NO NO
title: Mulliken charges:
elementType: C C C C C C C C C C H H H H H H H H H H H H
charge: -0.252463 -0.250103 -0.198574 -0.198582 -0.247046 -0.247048 -0.456600 -0.456620 -0.248281 -0.248291 0.251849 0.255453 0.239673 0.239675 0.239862 0.239863 0.215729 0.215591 0.215600 0.215744 0.237284 0.237286
chargesum: 0.00000
title: Mulliken charges with hydrogens summed into heavy atoms:
elementType: C C C C C C C C C C
charge: -0.000613 0.005350 0.041099 0.041093 -0.007184 -0.007186 -0.025280 -0.025276 -0.010997 -0.011005
polarizability: 9.03565337e+01 -9.35549504e-04 9.44976091e+01 2.61788855e+00 9.42210355e-04 8.64640659e+01
1716.lowfreq: -0.0007 -0.0005 -0.0005 5.6350 29.1161 38.3001 138.6760 245.0239 301.4470
frequency: 138.3563 245.0227 301.4458 433.6079 511.5156 584.0321 602.0293 647.0034 680.8586 709.6923 756.3359 776.8838 785.1890 802.7201 820.8179 868.3902 892.4998 914.9498 916.9462 922.6574 944.5031 945.0681 985.6122 1003.5795 1018.1248 1052.1874 1074.9379 1094.0124 1116.8643 1124.0184 1145.0401 1149.7419 1164.7215 1196.8602 1210.1257 1224.8047 1227.1323 1228.8681 1236.3084 1250.6575 1266.6445 1280.7323 1299.9524 1309.5148 1332.4872 1450.1638 1467.0138 1592.9445 2981.7603 2995.8384 3028.6470 3031.4450 3036.0596 3048.6677 3049.2476 3060.1967 3068.6367 3091.3943 3128.9540 3164.0515
redmass: 2.0819 3.0925 2.4145 2.2890 2.9934 4.1264 3.7933 5.4944 4.2643 1.8534 1.5280 4.2284 3.0443 1.9762 1.7639 1.8103 2.5510 1.6604 2.4523 2.1280 4.7100 1.3395 1.3880 2.2732 1.4778 1.8480 1.8303 1.2073 2.1804 1.3916 1.5377 2.6018 1.3821 1.5056 1.2747 1.4416 1.4285 1.6463 1.2998 1.6015 1.3373 1.7362 1.5056 1.4635 1.8063 1.0795 1.0962 6.0962 1.0600 1.0627 1.0895 1.0880 1.0977 1.0901 1.0894 1.1023 1.0896 1.0982 1.0861 1.1070
irintensity: 0.0198 0.3845 0.1035 7.8989 0.7052 0.5927 1.0783 1.1219 1.6960 5.6077 42.9499 2.2178 3.6028 15.0850 12.3377 0.0502 7.7346 0.5484 2.3992 6.0357 3.9929 0.9802 0.1730 3.2580 1.0715 0.3753 1.0662 0.7538 0.0172 0.9629 0.4916 0.6445 0.3670 2.7899 0.0069 2.8756 1.2554 0.4496 0.8981 1.5653 0.1255 6.6393 4.5144 2.2891 6.2001 6.2364 14.3418 2.3219 23.5794 64.6349 16.2281 17.9970 2.4166 2.9745 132.6928 36.2788 63.2820 84.8925 9.5730 30.3171
temp: 298.150 k
press: 1.00000 atm
elementType: 6 6 6 6 6 6 6 6 6 6 1 1 1 1 1 1 1 1 1 1 1 1
symmnumber: 1
zpe: 498773.8 jmol-1
zpe.correction: 0.189973 hartree
zpe.thermalcorrener: 0.196815 hartree
zpe.thermalcorrenthalpy: 0.197759 hartree
zpe.thermalcorrgfe: 0.158990 hartree
zpe.sumelectzpe: -387.448349 hartree
zpe.sumelectthermal: -387.441507 hartree
zpe.sumelectthermalent: -387.440563 hartree
zpe.sumelectthermalfe: -387.479332 hartree
dipole: 0.3625 0.0000 0.0930
dipole: 0.3743
quadrupole: -61.1956 -57.3735 -58.4876
quadrupole: -0.0003 0.7786 0.0001
quadrupole: -2.1767 1.6455 0.5313 -0.0003 0.7786 0.0001
hfenergy: -387.6383219 hartree
pointgroup: C01 [X(C10H12)]
dipole: -0.1440144 0.000005 -0.0306647 debye
dipolederiv: -0.0011353 -0.0000097 0.102102 -0.0000045 -0.0015012 -0.0000072 0.119346 -0.0000142 0.0656054 0.1124364 -0.000005 -0.0853506 -0.0000071 -0.0391456 -0.0000036 -0.1049328 0.0000003 0.0851146 0.0887401 0.0456733 -0.024086 0.0504925 0.0706836 0.0499619 -0.0076426 0.0463776 0.0450668 0.0886919 -0.0456667 -0.0240991 -0.0504954 0.0707223 -0.0499469 -0.0076522 -0.0463682 0.0450353 0.0352128 -0.1346928 -0.036858 -0.0268942 0.1210629 0.0849015 -0.0598031 0.0935914 -0.05434 0.0352604 0.1347001 -0.036848 0.0269108 0.1210679 -0.0848677 -0.0598172 -0.0935591 -0.0543678 0.0791791 0.0367242 0.0712597 0.0246888 0.0010383 -0.0114106 0.0568218 -0.0415239 0.0156628 0.0791603 -0.0367549 0.0712496 -0.0247348 0.0010252 0.011377 0.0567775 0.0415089 0.0156308 -0.2157789 0.0713401 0.1150251 0.067119 -0.0153691 0.0212398 0.1577627 -0.0187017 0.0536374 -0.2158013 -0.0713207 0.1150042 -0.0670999 -0.0153559 -0.0212721 0.1577472 0.018665 0.0536365 -0.0300165 0.0000216 -0.142487 0.0000187 0.0629315 0.0000262 -0.1247246 0.0000288 -0.1279091 -0.056858 -0.0000006 0.1572681 0.0000015 0.0741966 -0.0000003 0.1315063 0.0000002 -0.0941219 -0.0144736 -0.0906068 -0.0273881 -0.0742782 -0.145751 -0.0902989 -0.0259931 -0.1056042 0.0183764 -0.0144492 0.0905975 -0.0273584 0.0742626 -0.1458111 0.0902671 -0.0259599 0.1055639 0.018417 -0.002687 0.0819998 0.023116 0.0998131 -0.133782 -0.067612 0.0200282 -0.0883411 0.0353305 -0.0027218 -0.0820295 0.0231185 -0.0998397 -0.1337726 0.0675835 0.0200296 0.08831 0.0353548 0.0656802 0.0706647 -0.0931455 0.0335221 0.0150322 0.0523392 -0.0233227 0.0853476 -0.1028598 -0.1856016 -0.110557 0.0397505 -0.0684243 0.0114932 0.0069664 -0.0061829 -0.014773 0.0722124 -0.1855418 0.1106093 0.0398242 0.0685027 0.0114343 -0.0070155 -0.0061035 0.0147363 0.0722167 0.0656364 -0.0706782 -0.0932075 -0.0335495 0.0150979 -0.0522557 -0.023387 -0.0852784 -0.1028503 0.1375411 0.0257066 -0.0834344 0.0387923 0.027332 0.085915 -0.1222377 0.0848774 -0.0474107 0.1375264 -0.0257153 -0.083455 -0.0387965 0.0273706 -0.085887 -0.1222602 -0.0848435 -0.0474379 unknown
polarizability: 90.56638|0.0006149|94.4976091|2.4479554|0.0004407|86.2542196 unknown
InChI: InChI=1S/C10H12/c1-2-6-8-4-3-7-5(1)9(6)10(7)8/h1-2,5-10H,3-4H2
charge 0 multiplicity 1
22 atoms
C  -0.733827 0.000173 -1.350781
C  0.842163 0.000015 -1.286905
C  -0.788928 -1.226434 -0.372829
C  -0.788698 1.226604 -0.372603
C  0.826299 -1.222731 -0.294151
C  0.826538 1.222607 -0.293958
C  -1.563819 -0.785385 0.893345
C  -1.563574 0.78546 0.893558
C  1.44055 -0.683138 0.985846
C  1.440696 0.682695 0.985948
H  -1.329685 0.000305 -2.275001
H  1.525342 0.000022 -2.148812
H  -1.173951 -2.164672 -0.808867
H  -1.173592 2.164985 -0.808446
H  1.268906 -2.167783 -0.650506
H  1.269315 2.167636 -0.65017
H  -1.092921 -1.188935 1.808808
H  -2.600235 -1.172333 0.858476
H  -2.599866 1.172762 0.859006
H  -1.092354 1.188586 1.809039
H  1.79298 -1.316247 1.807504
H  1.793262 1.315608 1.8077
