program: Gaussian 09
title: 000144689
version: EM64L-G09RevD.01
frameworkgroup: C1[X(C11H10N4O)]
method: RPBEPBE
basis: SDD
operation: Freq
keyword: #p
keyword: freq=noraman
keyword: PBEPBE/SDD
title: #p freq=noraman PBEPBE/SDD
converged: YES YES NO NO
title: Mulliken charges:
elementType: O N N N N C C C C C C C C C C C H H H H H H H H H H
charge: -0.249736 -0.103932 -0.067994 0.019603 0.017995 0.173117 0.122897 0.327507 -0.285486 -0.298412 -0.312953 -0.325020 -0.669179 -0.163680 -0.153202 -0.537226 0.273705 0.268106 0.248401 0.263043 0.251464 0.247640 0.240526 0.230090 0.228711 0.254015
chargesum: 0.00000
title: Mulliken charges with hydrogens summed into heavy atoms:
elementType: O N N N N C C C C C C C C C C C
charge: -0.249736 -0.103932 -0.067994 0.019603 0.017995 0.173117 0.122897 0.327507 -0.011780 -0.030306 -0.064552 -0.061977 0.070451 -0.163680 -0.153202 0.175589
polarizability: 2.71082233e+02 2.59968677e+00 1.41164312e+02 5.15665765e-01 -2.84437066e+00 8.69961552e+01
1716.lowfreq: -3.7525 -0.0006 -0.0005 0.0001 1.9036 5.5836 16.8839 42.5783 63.3458
frequency: 16.6826 42.5745 63.3433 75.8434 112.6880 122.0074 141.9196 171.6888 197.5694 210.3257 223.7926 240.2063 256.6880 268.8941 330.5130 380.6518 412.5055 431.9989 464.7972 477.6557 505.0332 527.4311 543.8783 552.8874 612.9975 628.7666 692.0482 741.5247 766.5902 820.2664 821.4532 852.8707 862.9851 942.3248 974.7976 977.5293 982.2549 993.4531 1046.8208 1108.4096 1109.2780 1111.3865 1149.5316 1158.1182 1182.9243 1214.8390 1246.2731 1294.9833 1371.6625 1381.3671 1393.5690 1435.3783 1441.8931 1460.7883 1465.6772 1469.5657 1470.9611 1487.9122 1570.1822 1614.4190 2197.1038 2200.4484 2973.0460 3011.0227 3067.2142 3124.0421 3127.1009 3136.7844 3153.2270 3160.5692 3172.8521 3182.0832
redmass: 4.6355 6.1004 6.5382 5.2470 4.4093 8.5704 6.5185 4.4292 2.1693 2.9336 1.1679 1.8220 3.4990 6.8722 5.2585 6.0887 3.8957 4.3056 5.3422 6.1980 8.1483 4.0041 3.4969 11.7142 5.7903 6.9454 6.3019 3.9747 5.3642 3.4581 1.3968 1.6260 5.6919 2.0911 1.3700 8.0972 1.3455 2.6018 3.7634 2.2472 1.3019 1.2595 1.3825 1.4833 2.1984 2.9930 4.2216 1.3059 4.1255 1.3814 6.7815 1.3271 2.9568 1.0519 1.0461 1.0819 1.0717 2.3245 7.6618 6.2842 12.6664 12.6591 1.0324 1.0332 1.1046 1.1023 1.1022 1.1003 1.0874 1.0888 1.0962 1.0978
irintensity: 0.5700 1.6923 0.2100 0.7186 6.9374 2.3604 2.3418 1.9011 1.9556 0.9829 0.0570 1.7558 0.9793 6.0357 3.6777 3.6259 2.9656 0.4422 2.4389 0.2178 46.9597 11.8645 11.5906 0.3298 2.8110 2.1682 2.8117 1.2492 8.8434 2.6085 3.5905 80.9091 3.2847 1.3838 1.4798 64.6151 0.0479 2.7329 36.8398 71.8216 25.8009 0.2099 117.4203 46.1245 59.6288 2.9337 319.5676 2.7665 154.7182 7.9860 96.7271 1.5258 19.5548 10.5755 13.7457 40.4603 32.5737 50.9201 4.1088 243.7753 1.3529 1.5734 65.5550 8.2619 38.6703 12.9722 8.0721 20.3906 2.7116 0.8155 9.3799 4.7968
temp: 298.150 k
press: 1.00000 atm
elementType: 8 7 7 7 7 6 6 6 6 6 6 6 6 6 6 6 1 1 1 1 1 1 1 1 1 1
symmnumber: 1
zpe: 497245.0 jmol-1
zpe.correction: 0.189391 hartree
zpe.thermalcorrener: 0.205246 hartree
zpe.thermalcorrenthalpy: 0.206190 hartree
zpe.thermalcorrgfe: 0.144608 hartree
zpe.sumelectzpe: -718.152193 hartree
zpe.sumelectthermal: -718.136338 hartree
zpe.sumelectthermalent: -718.135394 hartree
zpe.sumelectthermalfe: -718.196976 hartree
dipole: 6.5449 -2.6975 3.5009
dipole: 7.8974
quadrupole: -85.8121 -98.1656 -95.3585
quadrupole: -5.5534 -13.2354 -5.0742
quadrupole: 7.3000 -5.0535 -2.2465 -5.5534 -13.2354 -5.0742
hfenergy: -718.3415838 hartree
pointgroup: C01 [X(C11H10N4O1)]
dipole: 2.5052867 -1.4168618 -1.1704061 debye
dipolederiv: -2.0996172 0.0042656 0.515376 -0.0296806 -0.2936018 0.001748 0.4230077 -0.0086293 -0.4445347 -0.5325395 -0.0336266 0.1178793 -0.3348338 -0.2455327 0.0460873 -0.8402577 -0.0062844 -0.1731756 1.5065689 0.0793721 -0.180765 0.2063603 -0.0658959 -0.0162623 0.1358488 -0.0024362 -0.1407741 -0.1441235 -0.0013217 0.004135 0.0297203 -0.1823891 0.0208814 0.1237377 0.0135266 -0.1579071 -0.1877881 -0.0099143 0.0038287 0.0538104 -0.1637894 -0.0140443 -0.0895684 -0.0090349 -0.1756243 0.542948 -0.0205347 -0.0269724 -0.0964695 0.3591485 -0.0215944 -0.0769346 -0.0317714 0.5524843 -1.0986203 -0.0477057 0.0955505 0.0576573 -0.0001528 -0.028592 0.4625121 0.001044 -0.1056699 1.9577447 0.0315598 -0.3833438 0.136115 0.1410404 -0.0162871 0.0058629 0.0142418 0.1850403 0.3973761 0.0184505 -0.0540182 -0.0733763 -0.0645015 0.0226602 -0.3543625 0.0100654 0.057888 0.5745139 0.024327 -0.0754899 0.1180424 -0.0784439 0.037348 0.2499039 0.0572507 0.0755987 -0.7812003 -0.030663 0.0302949 -0.1563537 -0.1951205 0.0580368 -0.4494664 0.0238883 0.0284233 -0.5363215 0.02584 0.1890739 0.1178569 -0.1658706 0.0322692 0.575047 0.0561776 -0.1177061 -0.1473332 0.0254566 -0.0128909 0.1140047 0.0660062 0.0134087 0.0782237 0.0202215 -0.0587753 -0.2451068 0.0148214 -0.0107026 -0.0021621 -0.1023137 -0.0036501 -0.0582037 0.0352005 -0.0815248 -0.1738154 -0.0493933 0.0390911 -0.0537859 -0.0517546 -0.0319687 0.2290329 -0.053903 -0.0778323 0.6380029 -0.0262137 -0.1924751 -0.1409703 0.3140579 0.0354561 -0.6649389 0.0046886 0.5147121 0.0885987 -0.0225335 -0.0704432 -0.0132123 0.1410395 -0.0319403 -0.0515986 -0.0293343 0.0435541 0.0955881 0.0120059 0.0693993 0.0046736 0.1490671 -0.0334583 0.0357417 -0.0363228 0.0049434 0.023994 0.0100727 0.076203 0.0152292 0.1520329 -0.0412443 0.0898162 -0.0421374 -0.0334823 0.0217123 -0.0274098 -0.0666233 -0.0276562 0.1597207 -0.0395946 -0.0675912 -0.0399209 0.0342518 0.1482025 0.010697 0.0425598 0.0242933 0.0673244 -0.0424051 0.0371871 -0.0564735 -0.0559141 0.0892755 0.0515655 -0.0649563 0.0527315 0.0021642 0.0674635 -0.0712656 0.0688513 0.0279457 -0.1313004 -0.0224847 0.0279651 -0.0665226 0.0757201 -0.0090164 0.0240053 -0.0069243 0.1113682 0.0656056 0.0804581 -0.0716548 0.0561656 -0.0208276 0.0903432 0.132187 0.0829927 -0.091705 0.0800804 -0.0798666 -0.0163508 0.03689 -0.1208 -0.0869084 0.1495243 -0.0529492 -0.0099588 -0.1524453 -0.0172247 0.0153297 -0.0285271 0.1236726 -0.0087361 -0.0274506 -0.0120274 0.0883744 unknown
polarizability: 270.3664132|3.9384958|87.9923095|-9.5878159|7.3377599|140.8839767 unknown
InChI: InChI=1S/C11H10N4O/c1-11(7-12,8-13)15-14-9-3-5-10(16-2)6-4-9/h3-6H,1-2H3
charge 0 multiplicity 1
26 atoms
O  4.886462 0.421376 0.107473
N  -1.481206 -0.137403 -0.06652
N  -0.684775 0.207694 0.896943
N  -3.356394 0.566075 2.924965
N  -4.214887 1.532107 -1.287941
C  -2.954225 -0.147104 0.374061
C  0.706343 0.223932 0.580216
C  3.499818 0.336612 0.193035
C  1.25855 -0.057696 -0.700885
C  1.566857 0.564166 1.661432
C  2.646808 -0.001616 -0.897636
C  2.953853 0.619166 1.4740
C  -3.463688 -1.603625 0.149548
C  -3.173516 0.268261 1.785679
C  -3.659628 0.792961 -0.535836
C  5.523669 0.15302 -1.189857
H  0.585493 -0.311068 -1.526096
H  1.115268 0.780885 2.634483
H  3.061187 -0.214773 -1.887224
H  3.634656 0.878287 2.289283
H  -3.238626 -1.903741 -0.886342
H  -2.942579 -2.279517 0.846858
H  -4.550171 -1.665302 0.323405
H  5.183309 0.873895 -1.95676
H  5.321829 -0.881361 -1.525952
H  6.599794 0.282671 -1.008133
