program: Gaussian 09
title: 000144687
version: EM64L-G09RevD.01
frameworkgroup: C1[X(C9H12O2)]
method: RPBEPBE
basis: SDD
operation: Freq
keyword: #pfreq=noraman
keyword: PBEPBE/SDD
title: #p freq=noraman PBEPBE/SDD
converged: NO YES NO NO
title: Mulliken charges:
elementType: O O C C C C C C C C C H H H H H H H H H H H H
charge: -0.181495 -0.188513 -0.164553 -0.173538 -0.454726 -0.461853 -0.473653 -0.447289 0.130438 0.163181 -0.619554 0.246956 0.249403 0.221704 0.224742 0.246422 0.228721 0.225160 0.226869 0.224296 0.241902 0.285027 0.250355
chargesum: 0.00000
title: Mulliken charges with hydrogens summed into heavy atoms:
elementType: O O C C C C C C C C C
charge: -0.181495 -0.188513 0.082402 0.075865 -0.008281 0.013290 -0.021625 0.018910 0.130438 0.163181 -0.084172
polarizability: 1.03362471e+02 -6.14298058e-01 9.51492971e+01 -9.55813776e-02 3.15361540e-01 8.15356427e+01
1716.lowfreq: -25.0322 -12.8509 0.0005 0.0006 0.0006 13.0057 33.4962 92.9667 158.0344
frequency: 31.5287 92.9393 157.9960 198.5441 234.5296 314.4242 345.3451 391.2128 425.4685 457.5414 481.9723 552.3628 603.0281 638.4530 738.1369 759.9530 775.8406 812.4580 853.3132 885.7311 892.4352 915.1202 934.5813 943.4721 1029.1502 1048.5722 1069.4261 1111.4486 1118.9181 1150.8083 1164.5629 1176.1917 1192.9083 1232.3385 1253.1766 1264.0734 1271.1335 1278.6526 1303.3452 1319.0573 1325.7059 1338.1339 1345.4464 1359.0561 1417.9950 1468.9716 1474.0627 1481.1437 1497.4319 1611.0305 1632.4033 2970.3445 2986.7387 2990.9827 2999.4980 3001.2911 3027.3043 3033.6664 3036.2479 3048.0305 3057.7031 3070.4975 3101.6112
redmass: 3.5080 6.1889 2.2401 2.0379 3.0833 2.5830 3.9106 6.1489 2.8127 4.7961 4.7988 3.0316 5.1179 3.5706 2.0222 1.9820 1.8482 3.4534 2.6367 2.8101 2.1715 3.1418 2.5030 1.6884 2.3284 1.8201 2.3333 2.2269 1.3196 1.7001 1.1429 1.8723 1.6958 1.2756 1.3051 1.3504 1.5341 1.4843 1.6839 1.4791 1.3298 1.4344 1.4762 1.3891 1.0838 1.0731 1.0790 1.0807 1.0856 8.4171 10.4676 1.0660 1.0605 1.0602 1.0649 1.0639 1.0892 1.0933 1.0920 1.0969 1.1029 1.1024 1.0935
irintensity: 1.4417 5.3125 0.1087 0.9128 3.2377 0.4832 1.1942 18.9866 0.6741 2.6382 8.5030 0.2562 0.5371 3.3362 3.2859 5.1969 13.5718 0.2783 3.6812 0.6178 2.3658 18.8881 0.3124 0.3901 36.9762 10.2551 5.0600 1.7725 13.3741 57.1892 6.1221 35.4552 14.7036 11.8197 1.7241 14.5942 3.8287 29.0007 6.6264 3.8593 0.8979 2.0562 5.1318 2.6761 29.6514 4.8012 11.7633 18.9848 10.8391 244.6192 121.7820 0.9538 27.3151 10.1924 26.6098 56.8479 24.7902 24.2723 8.6900 15.9925 47.3057 36.9147 3.2087
temp: 298.150 k
press: 1.00000 atm
elementType: 8 8 6 6 6 6 6 6 6 6 6 1 1 1 1 1 1 1 1 1 1 1 1
symmnumber: 1
zpe: 506591.3 jmol-1
zpe.correction: 0.192950 hartree
zpe.thermalcorrener: 0.202504 hartree
zpe.thermalcorrenthalpy: 0.203449 hartree
zpe.thermalcorrgfe: 0.157598 hartree
zpe.sumelectzpe: -499.754768 hartree
zpe.sumelectthermal: -499.745214 hartree
zpe.sumelectthermalent: -499.744270 hartree
zpe.sumelectthermalfe: -499.790120 hartree
dipole: -1.1714 -4.3624 -1.5406
dipole: 4.7725
quadrupole: -77.7557 -69.6594 -61.5529
quadrupole: 1.7180 -0.2524 -3.3680
quadrupole: -8.0997 -0.0034 8.1031 1.7180 -0.2524 -3.3680
hfenergy: -499.9477182 hartree
pointgroup: C01 [X(C9H12O2)]
dipole: 0.2343425 1.7367686 -0.6739499 debye
dipolederiv: -0.9439032 -0.1992793 0.0924292 -0.268569 -0.6191449 0.0116707 0.2323388 0.0185749 -0.290603 -0.7832965 0.2035116 -0.1134436 0.2613148 -0.7148612 0.0990132 -0.2888001 0.156451 -0.3306778 -0.0064983 -0.1000509 0.0065045 -0.0996134 -0.2258291 -0.0506072 -0.0073074 -0.1124028 0.0079727 0.0359155 -0.048565 -0.0094949 -0.0078125 -0.2890975 -0.0664719 -0.0389044 -0.1250256 0.0300296 0.0875809 0.0312107 0.0190357 -0.0068255 0.084978 0.0173452 0.0303835 -0.0129973 0.0586611 0.086635 0.0396666 0.0068726 -0.021248 0.0522156 -0.0217627 0.0002357 0.0504177 0.0860071 0.0446018 -0.0102246 -0.0122251 0.0193642 0.0766004 0.0532711 -0.0361266 0.0367425 0.0537608 0.0757374 -0.0280251 -0.003415 0.0141957 0.1280693 0.0066567 0.0267017 0.07863 0.0692051 1.1898348 0.0688389 -0.2882014 0.0832084 0.9518849 0.1072371 -0.4453185 0.1288919 0.1256968 1.0620987 -0.009237 0.2992739 -0.0207294 0.9730592 -0.0831632 0.4964561 -0.1543922 0.1447499 -0.7982254 0.0569065 -0.0029307 0.0719408 -0.1663302 -0.1076243 0.0281575 -0.1049283 -0.0545958 -0.1268757 0.0559409 0.0259218 0.0194488 0.0197075 -0.0024633 0.0364617 -0.0035297 0.0446046 -0.137719 -0.0077922 0.0183462 0.0149335 0.0329034 0.0114853 0.0146061 0.031891 0.050981 0.0347271 -0.008083 0.0208356 0.0494103 -0.1651286 -0.0098199 0.0354286 -0.0421173 0.0701812 -0.0310603 0.0071421 -0.0911501 -0.0369433 0.0850364 -0.0467524 -0.1000318 -0.0000456 -0.1061999 0.0218455 -0.0115225 0.0158222 -0.0433204 -0.0044497 0.1292999 0.0248965 0.0900374 -0.0404041 0.0097826 0.0351335 0.0342374 0.0725658 -0.1020251 -0.1140625 0.0125589 -0.083489 0.0348011 0.0294369 0.0195201 -0.0083034 0.0496971 0.0134578 -0.1381599 0.0259503 -0.092668 -0.1099069 -0.0133197 -0.074114 0.0452248 -0.1051327 -0.115615 0.0777209 0.0083072 0.0287662 0.0724271 0.0220173 -0.0282741 0.0204284 -0.0889246 -0.1647147 -0.0128876 0.0313568 -0.00082 0.064664 -0.0185821 0.0100917 -0.0815641 0.0608492 0.0633073 0.0690736 -0.0759408 0.0283408 -0.0735292 0.0378759 -0.0138376 0.0028347 -0.0171464 -0.0587297 0.0020445 -0.0020487 0.0427117 0.1101479 0.1213907 0.0110427 0.0029613 -0.0006636 0.144706 0.0689567 -0.0093612 0.0409606 -0.0179734 unknown
polarizability: 103.3601968|0.5514704|95.0892539|0.5681064|-0.8499367|81.5979604 unknown
InChI: InChI=1S/C9H12O2/c10-8-5-9(11)7-2-1-6(8)3-4-7/h6-7H,1-5H2
charge 0 multiplicity 1
23 atoms
O  -2.439277 -1.397161 0.271991
O  1.996992 -1.797701 0.462305
C  -1.312851 0.759945 0.155278
C  1.473627 0.499142 -0.156581
C  -0.732231 1.513575 -1.074641
C  -0.477684 1.090199 1.442128
C  0.77457 1.205245 -1.348909
C  1.053516 1.19686 1.174963
C  -1.399814 -0.756882 -0.034834
C  1.171439 -1.001467 -0.058224
C  -0.173755 -1.49869 -0.59056
H  -2.353251 1.090627 0.327701
H  2.571736 0.585305 -0.25535
H  -0.859103 2.594317 -0.873091
H  -1.341403 1.295389 -1.971299
H  -0.68545 0.325719 2.21367
H  -0.850939 2.047476 1.849694
H  0.891421 0.59954 -2.267204
H  1.310366 2.152835 -1.544014
H  1.355843 2.258407 1.092781
H  1.624032 0.76433 2.015407
H  -0.281345 -2.578123 -0.401234
H  -0.182239 -1.339887 -1.690575
