program: Gaussian 09
title: 000148963
version: EM64L-G09RevD.01
frameworkgroup: C1[X(C16H12N2O)]
method: RPBEPBE
basis: SDD
operation: Freq
keyword: #p
keyword: freq=noraman
keyword: PBEPBE/SDD
title: #p freq=noraman PBEPBE/SDD
converged: NO NO NO NO
title: Mulliken charges:
elementType: O N N C C C C C C C C C C C C C C C C H H H H H H H H H H H H
charge: -0.266861 -0.468151 0.002171 0.060371 0.182861 0.208693 0.193015 0.257795 0.430223 -0.381948 -0.485523 -0.447540 -0.367496 0.309067 -0.491798 -0.351302 -0.368954 -0.375991 -0.538695 0.304216 0.236566 0.248685 0.239765 0.232092 0.242049 0.242118 0.235030 0.239288 0.217315 0.217317 0.245624
chargesum: 0.00000
title: Mulliken charges with hydrogens summed into heavy atoms:
elementType: O N N C C C C C C C C C C C C C C C C
charge: -0.266861 -0.163935 0.002171 0.060371 0.182861 0.208693 0.193015 0.257795 0.430223 -0.145382 -0.236839 -0.207775 -0.135404 0.309067 -0.249750 -0.109184 -0.133924 -0.136703 0.141560
polarizability: 3.30662268e+02 -1.01991261e+01 2.19474262e+02 -4.98256694e-03 -1.03191732e-02 7.77465622e+01
1716.lowfreq: -0.0006 -0.0004 0.0007 2.1215 4.2188 7.9389 50.9508 75.4168 90.7463
frequency: 50.9182 75.4127 90.7439 112.9676 161.2745 172.2739 223.9705 233.7061 257.8519 294.3575 323.5674 374.4261 379.0123 406.2170 420.7811 434.3914 481.8690 490.3389 516.1548 518.7302 545.1475 573.4953 596.7740 615.9900 650.8113 701.7400 702.0373 747.1496 751.2093 759.4350 790.8543 792.0016 810.1866 821.0258 848.4379 873.7334 877.5014 911.8620 916.1259 949.1413 951.9588 967.9561 999.6908 1013.3667 1047.6075 1113.3481 1118.8800 1134.0394 1155.5414 1174.4611 1187.7925 1205.1481 1226.7172 1235.2123 1257.3926 1292.1787 1302.6033 1326.4022 1339.5322 1379.6857 1402.9997 1423.3963 1433.3756 1443.8387 1447.2354 1466.6292 1467.4444 1472.7442 1489.2272 1506.8218 1547.2004 1582.8585 1594.4254 1611.5144 1644.8869 2948.8747 3032.5345 3118.0838 3126.0107 3127.3585 3135.6003 3148.1018 3150.3960 3154.1860 3165.9881 3186.7684 3611.5819
redmass: 3.7155 4.2494 4.0292 5.5231 4.7328 3.5734 3.9655 1.8242 1.9821 5.1343 4.4870 5.8948 4.7196 5.6036 3.2656 2.9690 6.1085 1.1960 6.4108 3.9951 4.7238 3.3572 5.1713 3.2257 6.8365 6.5787 3.4827 6.3673 3.2719 6.3597 2.0433 1.5642 2.3684 4.8482 1.4641 1.6493 5.2051 1.5333 1.3762 6.9244 1.3438 1.4320 6.2844 2.7669 2.5415 1.2596 2.2609 1.4442 1.4646 1.5542 1.9021 2.1195 1.3312 2.0228 2.0958 3.6988 1.8486 2.7929 6.1798 1.8297 4.7193 2.4527 1.6113 1.8264 2.6880 3.5316 1.0500 1.2295 3.0298 6.0365 5.2830 6.0676 6.6689 7.3005 7.8252 1.0337 1.1035 1.0984 1.0871 1.0868 1.0891 1.0917 1.0976 1.0971 1.0946 1.0910 1.0804
irintensity: 6.2354 3.7128 0.0309 0.9162 0.0842 0.0872 2.1413 0.1131 0.8984 1.4996 0.0577 1.1556 4.5894 0.3632 5.2319 0.0000 3.1187 90.9323 7.8506 0.4564 0.2112 38.6994 6.1052 3.2116 4.9966 1.1371 0.8675 2.7366 0.1720 17.2555 2.2438 53.8744 4.0427 0.2792 76.2149 40.6484 0.0758 1.5362 2.8835 17.5826 0.0049 0.8909 19.9619 36.1597 21.1266 0.2003 13.9362 2.7665 33.7424 25.8565 104.9069 98.3735 4.7865 8.5958 18.9166 0.2216 43.8884 127.4573 11.8280 2.9049 14.0636 33.5021 19.8387 13.0751 39.6893 63.5879 13.1020 62.7335 30.6422 44.9884 6.3015 70.3579 19.7487 3.3938 25.0807 96.1874 54.6282 26.6383 3.5026 0.4939 9.7120 39.1980 29.0312 20.2512 15.2177 3.4303 66.6102
temp: 298.150 k
press: 1.00000 atm
elementType: 8 7 7 6 6 6 6 6 6 6 6 6 6 6 6 6 6 6 6 1 1 1 1 1 1 1 1 1 1 1 1
symmnumber: 1
zpe: 628776.5 jmol-1
zpe.correction: 0.239488 hartree
zpe.thermalcorrener: 0.253844 hartree
zpe.thermalcorrenthalpy: 0.254788 hartree
zpe.thermalcorrgfe: 0.198359 hartree
zpe.sumelectzpe: -800.352155 hartree
zpe.sumelectthermal: -800.337800 hartree
zpe.sumelectthermalent: -800.336856 hartree
zpe.sumelectthermalfe: -800.393284 hartree
dipole: -2.3908 5.8292 0.0000
dipole: 6.3005
quadrupole: -80.9009 -103.0013 -116.5528
quadrupole: 6.5941 -0.0021 -0.0028
quadrupole: 19.2507 -2.8496 -16.4011 6.5941 -0.0021 -0.0028
hfenergy: -800.5916436 hartree
pointgroup: C01 [X(C16H12N2O1)]
dipole: -1.0100277 2.2636824 0.000017 debye
polarizability: 331.180087|-6.7954978|218.9564428|-0.004666|-0.0104661|77.7465622 unknown
InChI: InChI=1S/C16H12N2O/c1-19-11-3-5-14-12(8-11)16-13-9-17-7-6-10(13)2-4-15(16)18-14/h2-9,18H,1H3
charge 0 multiplicity 1
31 atoms
O  -3.89801 -1.890594 0.000466
N  -0.476035 2.522433 -0.000006
N  2.698931 -2.66831 0.000208
C  0.545691 0.456171 0.000109
C  -0.900686 0.252553 0.000159
C  0.761193 1.87039 0.000006
C  -1.504284 1.564399 0.000066
C  1.688645 -0.417169 0.000141
C  3.012674 0.181604 0.000135
C  2.05762 2.459051 -0.000021
C  -1.744648 -0.883049 0.000302
C  3.165604 1.614287 0.000054
C  -2.899037 1.746431 0.000071
C  -3.145235 -0.702022 0.000334
C  1.62218 -1.850769 0.000147
C  -3.72433 0.602326 0.000201
C  4.142263 -0.694821 0.000205
C  3.948427 -2.079904 0.00026
C  -5.352994 -1.776916 0.00076
H  -0.60945 3.530772 -0.000125
H  2.180922 3.547812 -0.000092
H  -1.360635 -1.90523 0.000403
H  4.177951 2.034175 0.000055
H  -3.345053 2.746878 -0.000024
H  0.653132 -2.358353 0.000083
H  -4.810896 0.729513 0.000157
H  5.156624 -0.279811 0.000199
H  4.796609 -2.772864 0.000334
H  -5.721878 -1.252332 -0.903572
H  -5.721488 -1.251953 0.905034
H  -5.724105 -2.8128 0.001049
