program: Gaussian 09
title: 000148964
version: EM64L-G09RevD.01
frameworkgroup: C1[X(C13H9NO4)]
method: RPBEPBE
basis: SDD
operation: Freq
keyword: #p
keyword: freq=noraman
keyword: PBEPBE/SDD
title: #p freq=noraman PBEPBE/SDD
converged: YES YES NO NO
title: Mulliken charges:
elementType: O O O O N C C C C C C C C C C C C C H H H H H H H H H
charge: -0.429983 -0.211334 -0.204723 -0.199865 0.022319 0.272916 0.354663 0.125092 -0.355442 -0.472984 0.405301 -0.380994 -0.370360 -0.398427 -0.220891 -0.229185 0.069392 -0.234213 0.267363 0.326318 0.291302 0.240556 0.246077 0.231608 0.230934 0.234185 0.390373
chargesum: 0.00000
title: Mulliken charges with hydrogens summed into heavy atoms:
elementType: O O O O N C C C C C C C C C C C C C
charge: -0.039609 -0.211334 -0.204723 -0.199865 0.022319 0.272916 0.354663 0.125092 -0.088079 -0.146666 0.405301 -0.089691 -0.129804 -0.152351 0.010717 0.001750 0.069392 -0.000028
polarizability: 2.82473945e+02 5.78592459e-01 1.62140101e+02 2.15882485e+00 1.44966545e+01 8.60574551e+01
1716.lowfreq: -0.0007 -0.0005 0.0002 2.7933 7.6826 8.4485 41.0911 46.8816 55.2629
frequency: 41.0489 46.8492 55.2371 62.5375 90.4964 141.4410 144.8808 173.3949 230.4627 238.2727 305.6336 334.9767 350.5425 403.6645 413.2200 440.4650 490.4405 512.0703 538.0950 571.4967 596.7974 614.0751 616.9021 641.8355 672.9812 701.0743 708.3849 726.5949 738.8254 760.1991 786.2387 850.8023 861.5505 867.4121 925.3399 966.1587 976.5223 987.9587 991.2228 996.9747 997.7888 1003.4892 1037.4080 1085.6128 1095.1838 1129.5023 1158.1563 1175.6061 1193.8481 1213.4092 1257.1388 1287.8315 1299.3371 1317.3936 1362.8397 1375.7852 1388.1643 1404.2184 1438.4958 1464.0908 1494.6076 1573.2844 1585.7984 1601.9551 1611.3135 1649.3657 3126.7543 3129.8391 3141.7433 3152.8266 3156.4732 3168.5641 3185.2549 3196.4758 3524.6083
redmass: 8.4484 8.0969 6.8248 5.8380 5.9649 7.8969 5.3576 5.8786 6.1884 8.4626 6.3768 6.5027 8.8076 2.8413 3.6375 5.0074 7.8274 4.4427 3.6205 4.5680 1.6086 4.6028 3.5899 7.6638 4.8764 1.8044 5.2710 5.3658 9.8336 2.3874 3.3110 1.2592 1.4961 6.1049 1.4086 1.4767 1.3916 5.3339 4.0383 1.4965 1.4188 4.1643 2.0210 1.6215 1.6989 2.1549 1.6039 1.0527 1.1290 7.6014 1.6907 2.3332 2.2265 1.4396 5.4981 7.3326 9.0825 4.7976 2.4401 2.3694 2.8780 7.7144 6.2557 7.2211 6.1214 9.2288 1.0853 1.0877 1.0921 1.0965 1.0899 1.1017 1.0957 1.0923 1.0642
irintensity: 1.4612 0.5140 0.1503 0.2084 1.4929 3.6379 0.7683 2.5653 0.2335 0.2243 1.9733 2.9948 2.3393 2.2594 8.2954 3.0272 12.1851 8.4732 3.9080 28.9285 73.1467 23.9909 34.1638 2.4621 49.8405 36.9127 13.2232 5.1459 21.1424 55.9540 15.1394 2.5946 26.6762 19.7175 1.2215 37.9441 1.2509 0.9628 80.2954 5.9313 0.9235 133.8747 13.8253 3.7971 65.7477 11.0489 69.4219 0.0008 19.1820 466.7865 16.4731 10.2088 58.4719 4.9186 95.2815 15.6718 1.4451 35.0084 7.9983 32.3988 4.0091 31.5304 15.6725 46.7373 2.3010 264.2810 3.8036 0.5188 10.6563 29.4115 5.6126 27.0509 2.0693 10.7871 49.4760
temp: 298.150 k
press: 1.00000 atm
elementType: 8 8 8 8 7 6 6 6 6 6 6 6 6 6 6 6 6 6 1 1 1 1 1 1 1 1 1
symmnumber: 1
zpe: 505764.6 jmol-1
zpe.correction: 0.192636 hartree
zpe.thermalcorrener: 0.207447 hartree
zpe.thermalcorrenthalpy: 0.208391 hartree
zpe.thermalcorrgfe: 0.149174 hartree
zpe.sumelectzpe: -855.107966 hartree
zpe.sumelectthermal: -855.093155 hartree
zpe.sumelectthermalent: -855.092210 hartree
zpe.sumelectthermalfe: -855.151428 hartree
dipole: -4.9383 -0.3867 0.4801
dipole: 4.9766
quadrupole: -122.0537 -90.7305 -102.5553
quadrupole: 6.1025 -4.8076 5.0868
quadrupole: -16.9405 14.3826 2.5579 6.1025 -4.8076 5.0868
hfenergy: -855.3006013 hartree
pointgroup: C01 [X(C13H9N1O4)]
dipole: -1.9403044 0.2208148 -0.141664 debye
polarizability: 282.4499662|-1.67532|149.7555377|-1.944293|31.6519603|98.4659972 unknown
InChI: InChI=1S/C13H9NO4/c15-13(16)12-8-10(14(17)18)6-7-11(12)9-4-2-1-3-5-9/h1-8,15H
charge 0 multiplicity 1
27 atoms
O  0.590281 -3.070827 -0.953854
O  -1.288204 -2.502475 0.282971
O  4.619522 1.572226 0.254665
O  4.644163 -0.644892 -0.285856
N  4.027723 0.450908 0.006331
C  -0.286014 0.378081 0.129942
C  -1.773309 0.468037 0.071325
C  0.459085 -0.81831 -0.138845
C  0.443977 1.570777 0.399514
C  1.872974 -0.781704 -0.195008
C  2.546424 0.425105 0.061414
C  1.84775 1.609785 0.378166
C  -2.493368 -0.039353 -1.043351
C  -2.487394 1.141769 1.098161
C  -3.891681 0.11461 -1.123408
C  -3.889492 1.283284 1.02455
C  -0.202154 -2.159235 -0.233587
C  -4.596714 0.772349 -0.087854
H  -0.1158 2.491897 0.588704
H  2.441671 -1.687723 -0.414184
H  2.404514 2.528992 0.577845
H  -1.954558 -0.535919 -1.85814
H  -1.947143 1.522334 1.972819
H  -4.431656 -0.275744 -1.992737
H  -4.428417 1.78734 1.83408
H  -5.684723 0.885019 -0.148176
H  0.149143 -3.96263 -0.936188
