program: Gaussian 09
title: 000148972
version: EM64L-G09RevD.01
frameworkgroup: C1[X(C15H20N2O3)]
method: RPBEPBE
basis: SDD
operation: Freq
keyword: #p
keyword: freq=noraman
keyword: PBEPBE/SDD
title: #p freq=noraman PBEPBE/SDD
converged: YES YES NO NO
title: Mulliken charges:
elementType: O O O N N C C C C C C C C C C C C C C C H H H H H H H H H H H H H H H H H H H H
charge: -0.221344 -0.283997 -0.267014 -0.111031 -0.389866 -0.163102 -0.391031 -0.597369 0.114997 -0.695547 0.236786 0.512170 -0.399503 -0.377840 0.343631 -0.385185 -0.354952 -0.256605 -0.394010 -0.677702 0.245413 0.253845 0.224531 0.267258 0.226958 0.230786 0.219398 0.249770 0.352736 0.228319 0.267720 0.250304 0.249255 0.202416 0.203135 0.218480 0.219035 0.210339 0.228065 0.210751
chargesum: 0.00000
title: Mulliken charges with hydrogens summed into heavy atoms:
elementType: O O O N N C C C C C C C C C C C C C C C
charge: -0.221344 -0.283997 -0.267014 -0.111031 -0.037130 0.082311 0.087345 -0.103154 0.114997 0.004408 0.236786 0.512170 -0.171184 -0.110121 0.343631 -0.134881 -0.105697 0.148946 0.043506 -0.028547
polarizability: 2.46653196e+02 -3.72605487e+00 1.67843116e+02 -1.10366309e+00 -1.35510626e+01 1.45467260e+02
1716.lowfreq: -2.3903 -0.0006 -0.0003 0.0007 3.4767 10.9201 16.7941 24.8170 35.9166
frequency: 16.6596 24.8113 35.9099 46.1496 71.5546 84.9988 86.6892 107.7546 134.1691 157.9643 165.4841 191.0904 209.9017 214.5078 238.5221 263.9377 291.3506 299.8196 324.5246 330.5772 386.0991 392.4918 414.0764 465.0238 484.4907 507.5782 517.8704 561.6329 591.3367 632.4900 664.7880 687.9589 700.0943 715.8641 758.4701 768.9042 769.9703 775.4954 818.7312 826.8111 835.0310 847.5618 883.0216 897.9651 902.0257 932.0365 952.7269 960.7622 970.3274 981.0359 1003.8640 1028.9989 1053.5886 1070.5053 1098.6572 1113.4090 1128.9923 1135.9499 1141.8221 1164.9375 1183.4409 1211.5164 1225.2138 1229.5287 1230.7856 1264.6033 1286.7382 1287.4179 1297.4228 1306.4980 1310.8409 1312.5518 1347.4945 1354.8918 1367.3463 1373.7504 1386.3770 1388.7205 1396.0169 1419.2641 1423.4137 1461.1716 1472.5318 1473.4242 1479.2466 1479.6548 1479.7033 1486.9283 1489.9685 1503.4886 1583.6016 1621.7731 1632.7450 1648.5486 2946.5236 2966.8069 2978.6578 2987.9239 3004.0070 3004.5941 3005.0317 3045.8738 3048.8653 3052.6879 3076.3894 3081.0717 3084.3425 3085.5995 3098.7609 3115.2277 3133.7705 3163.3011 3166.2135 3523.4414
redmass: 4.3564 4.6566 4.2935 4.2795 4.7795 1.8866 3.9922 3.2236 2.8705 4.7378 6.2803 1.1145 3.9120 1.1772 3.3333 4.4232 3.6841 5.0944 2.2708 5.7617 3.3917 2.8267 2.9895 4.6558 4.0849 5.7016 3.8439 4.2215 4.2354 6.5884 2.2894 3.6254 7.0998 4.3041 4.2049 1.7240 1.2292 3.3676 3.8245 1.2637 2.5508 1.9339 2.3962 1.1427 1.7239 1.7814 1.4490 1.5858 1.3620 6.6231 2.7711 1.6618 2.7730 1.7202 2.2488 1.8364 1.9725 2.1551 1.4416 1.8336 1.3115 2.2715 2.5334 3.4369 1.2687 1.7962 1.5676 1.1043 1.4619 1.7177 1.3579 1.4989 1.6648 1.4587 1.6114 2.0497 1.6201 1.5772 1.2867 2.9815 2.4084 1.1045 1.0570 1.0762 1.0648 1.0609 1.0684 1.1422 1.1531 2.1046 6.9554 6.3843 9.9678 5.0200 1.0551 1.0663 1.0363 1.0352 1.0631 1.0996 1.0664 1.0860 1.0967 1.1015 1.1002 1.1030 1.0987 1.0998 1.1004 1.0897 1.0899 1.0940 1.0949 1.0767
irintensity: 0.9735 1.6812 2.3485 0.6427 0.1057 0.0809 0.5290 0.2331 1.0837 3.6542 8.3327 0.1429 2.3438 0.0319 0.7519 7.1814 0.6778 3.7185 2.4796 10.2531 3.6177 11.5231 0.2146 6.5549 2.0297 10.2032 34.9150 8.0549 28.0667 1.3508 11.8640 18.5171 5.7428 1.2928 21.6270 53.5445 38.7692 25.2627 24.6748 0.6907 3.8488 50.7127 1.5849 3.2071 7.7177 3.0167 0.3672 1.8992 2.7631 98.8889 6.6291 5.6194 7.3443 11.6347 9.5706 22.0976 7.1779 7.4150 0.3093 104.4150 99.0569 10.0181 313.1827 87.1332 1.2831 155.7768 68.6240 0.0045 9.9730 12.1354 1.7708 13.6681 44.3814 19.9783 9.4854 11.6502 24.0995 6.2373 25.0623 84.0493 80.8283 30.1037 31.7538 17.4558 12.0698 8.7712 6.0812 45.1886 58.7706 83.1860 6.5498 92.1684 243.4680 426.8104 31.9829 38.8447 37.7966 19.5684 32.5882 29.2127 24.9374 7.9714 16.3673 0.0620 3.1599 82.4196 43.1915 27.9983 19.6149 19.4012 3.5995 12.4843 6.9723 48.8184
temp: 298.150 k
press: 1.00000 atm
elementType: 8 8 8 7 7 6 6 6 6 6 6 6 6 6 6 6 6 6 6 6 1 1 1 1 1 1 1 1 1 1 1 1 1 1 1 1 1 1 1 1
symmnumber: 1
zpe: 866248.8 jmol-1
zpe.correction: 0.329937 hartree
zpe.thermalcorrener: 0.349849 hartree
zpe.thermalcorrenthalpy: 0.350793 hartree
zpe.thermalcorrgfe: 0.278859 hartree
zpe.sumelectzpe: -917.300142 hartree
zpe.sumelectthermal: -917.280230 hartree
zpe.sumelectthermalent: -917.279286 hartree
zpe.sumelectthermalfe: -917.351220 hartree
dipole: 3.1026 2.4725 -1.0715
dipole: 4.1094
quadrupole: -119.0209 -116.5034 -128.5125
quadrupole: -23.1953 -1.7524 -3.5027
quadrupole: 2.3247 4.8421 -7.1669 -23.1953 -1.7524 -3.5027
hfenergy: -917.6300786 hartree
pointgroup: C01 [X(C15H20N2O3)]
dipole: 1.2323016 -0.6259413 0.8388031 debye
polarizability: 245.9351707|9.0935549|153.5133373|2.5544457|-16.9311193|160.5150639 unknown
InChI: InChI=1S/C15H20N2O3/c1-3-8-20-13-6-4-12(5-7-13)10-17-9-11(2)14(18)16-15(17)19/h4-7,11,16H,3,8-10H2,1-2H3
charge 0 multiplicity 1
40 atoms
O  -5.183938 2.173921 0.409407
O  -2.288417 0.119916 -2.595205
O  4.10603 -0.077907 0.826872
N  -2.260527 -0.655028 -0.373397
N  -3.626548 1.178056 -1.000503
C  -4.01162 0.151107 1.209421
C  -2.551603 -0.321669 1.038648
C  -1.228533 -1.681362 -0.675031
C  -4.330975 1.267832 0.210172
C  -5.037962 -1.00176 1.039996
C  -2.678013 0.183644 -1.390933
C  0.18533 -1.249842 -0.301047
C  0.843775 -1.792928 0.832549
C  0.870722 -0.285247 -1.080389
C  2.815453 -0.416415 0.397217
C  2.144905 -1.386191 1.183778
C  2.174312 0.137171 -0.741802
C  4.860951 0.914488 0.037147
C  6.222876 1.08672 0.713456
C  7.106318 2.106123 -0.038884
H  -4.130755 0.590059 2.215958
H  -1.847411 0.455035 1.40223
H  -2.381675 -1.229834 1.644405
H  -1.300988 -1.877531 -1.758462
H  -1.505327 -2.604451 -0.131631
H  -4.911822 -1.506414 0.065512
H  -4.901405 -1.752795 1.838971
H  -6.068923 -0.61415 1.102964
H  -3.87161 1.844979 -1.739386
H  0.337853 -2.55164 1.443385
H  0.376334 0.134892 -1.964395
H  2.661644 -1.804523 2.052885
H  2.676415 0.880622 -1.367716
H  4.303763 1.874686 0.015566
H  4.97871 0.54935 -1.004872
H  6.064068 1.414087 1.75777
H  6.725621 0.102763 0.757934
H  6.628839 3.103298 -0.077697
H  8.083006 2.22175 0.462974
H  7.299625 1.78259 -1.078968
