program: Gaussian 09
title: 000148950
version: EM64L-G09RevD.01
frameworkgroup: C1[X(C20H24O3)]
method: RPBEPBE
basis: SDD
operation: Freq
keyword: #pfreq=noraman
keyword: PBEPBE/SDD
title: #p freq=noraman PBEPBE/SDD
converged: YES YES NO NO
title: Mulliken charges:
elementType: O O O C C C C C C C C C C C C C C C C C C C C H H H H H H H H H H H H H H H H H H H H H H H H
charge: -0.256904 -0.442230 -0.278635 0.409256 0.315734 0.359034 -0.595800 0.178765 -0.599040 -0.314198 -0.847246 -0.796930 -0.308799 0.371055 -0.333168 -0.822876 -0.535014 -0.213794 -0.332214 0.453817 -0.847998 -0.437752 0.141740 0.227760 0.242206 0.228798 0.234302 0.238131 0.234969 0.215017 0.239048 0.239096 0.209198 0.209580 0.237307 0.233204 0.226225 0.223432 0.223492 0.247048 0.233903 0.221400 0.304608 0.226552 0.226211 0.240547 0.371161
chargesum: 0.00000
title: Mulliken charges with hydrogens summed into heavy atoms:
elementType: O O O C C C C C C C C C C C C C C C C C C C C
charge: -0.256904 -0.071070 -0.278635 0.409256 0.315734 0.359034 -0.368040 0.178765 -0.356835 -0.085400 -0.139843 -0.103769 -0.099600 0.371055 -0.123587 -0.126141 0.158959 0.020110 -0.110814 0.453817 -0.090628 -0.197204 0.141740
polarizability: 8.30362929e+02 3.14183941e+01 2.65773192e+02 2.11058535e+00 1.17726520e+00 1.15464609e+02
1716.lowfreq: -4.4763 -1.2024 -0.0010 -0.0003 0.0014 3.5548 4.6293 23.9150 25.5827
frequency: 3.8153 23.9144 25.5428 42.5285 44.3071 69.0031 79.0611 81.2363 99.6808 118.3829 122.3457 128.6734 136.0899 147.1962 156.7646 175.2383 187.7087 198.0649 201.9186 238.1128 250.8538 259.9540 270.5111 272.3374 282.7313 307.9923 328.6546 365.6238 391.3989 393.5499 425.7267 448.0496 451.7413 467.3199 514.6565 522.3516 539.8437 547.3423 572.2231 585.3635 619.7920 638.7405 663.0803 676.4351 694.0205 743.4515 745.6648 829.3734 841.6679 844.4359 857.8898 872.5770 890.5991 895.0127 899.0772 905.4379 934.8828 965.5966 969.6632 979.4139 993.2509 1008.4146 1018.8626 1024.1540 1037.9578 1040.8299 1046.7791 1050.6115 1059.6551 1092.4814 1111.8587 1158.2590 1173.4582 1191.9518 1202.3763 1209.6146 1230.2776 1263.1422 1273.7627 1288.8893 1296.4035 1304.9844 1320.4319 1329.5412 1369.7190 1383.3004 1387.8771 1395.6957 1399.9634 1402.3321 1404.0591 1407.7242 1440.2532 1457.4006 1466.7545 1467.0590 1467.4437 1470.2582 1471.1217 1472.7542 1476.2118 1488.7178 1495.1178 1504.6754 1550.8846 1565.2287 1573.7998 1603.4586 1616.1416 1624.1034 1636.9975 2962.9377 2975.3286 2975.4096 2980.4528 2983.4325 3045.1375 3052.0718 3052.7297 3055.7532 3061.8689 3083.5390 3086.1125 3089.9962 3091.1244 3091.3036 3110.5183 3122.0221 3122.2228 3126.5817 3129.6243 3135.3546 3141.0663 3148.3321 3524.9143
redmass: 3.7549 5.1959 4.9067 3.8816 3.6491 1.8379 2.4326 2.9752 2.5004 4.0585 2.5970 1.3399 2.3926 1.1694 2.1184 1.6737 4.3355 2.3178 1.5339 1.7896 4.5331 3.9492 2.1822 2.1377 2.7865 2.9914 3.6640 4.9746 3.3242 4.0870 4.3490 4.0886 2.9596 4.0834 4.4082 3.1844 2.3260 4.0537 1.1602 3.5998 3.6916 4.2255 3.9608 4.9087 3.8873 2.6862 5.1299 3.9574 1.6117 3.1770 1.4737 1.7279 1.9051 2.2508 1.6335 1.8297 6.2473 1.1411 3.2861 1.1413 1.5093 2.0032 1.4235 1.7727 1.5099 1.5601 1.5308 1.5318 1.7801 4.2695 1.2619 1.4502 4.1184 1.8550 1.8940 1.6884 2.0051 1.6069 1.7363 1.5563 2.1751 1.5390 1.4854 3.1798 2.4170 1.4161 2.0180 1.2595 1.2497 1.5661 1.4883 3.1392 1.2381 1.0453 1.0569 1.1182 1.0721 1.0969 1.0915 1.1206 1.0468 1.2096 1.0482 2.7505 3.5931 6.6304 4.8159 5.0662 6.0036 6.0990 5.3145 1.0327 1.0385 1.0392 1.0390 1.0365 1.0970 1.0978 1.1038 1.0964 1.0969 1.0981 1.0901 1.0894 1.1002 1.0879 1.0952 1.0922 1.0918 1.0998 1.0877 1.0898 1.0897 1.0902 1.0639
irintensity: 0.3494 0.1883 0.0935 1.1448 0.1441 2.0335 0.1171 0.4296 2.0051 0.6296 0.8533 3.9426 3.1710 0.5616 0.1325 0.0471 0.0997 2.9256 1.9240 0.2108 11.1140 0.2384 0.0506 1.1777 1.4017 0.3742 8.7883 13.1939 9.2315 0.2057 46.6318 4.7614 2.9554 1.9214 7.0515 7.3297 0.6350 38.1682 143.5449 34.7702 3.8383 0.2316 0.5041 1.3075 24.8157 0.0621 1.4131 1.7329 11.5107 15.3381 22.3080 2.0709 3.0131 4.1789 13.7801 1.4548 157.0503 11.4204 28.5694 112.8504 20.9187 61.9156 12.4828 238.5180 3.3660 5.5521 2.9212 9.5974 833.9176 100.5552 0.1609 23.9263 125.9719 100.4953 21.4121 28.3466 4.1486 65.6705 221.9172 121.7249 232.3124 12.7738 117.8230 9.0498 112.8831 68.9328 18.6850 28.3012 2.7224 69.8082 32.2154 15.4384 8.9765 11.9364 53.4372 242.9885 51.5898 110.4543 3.8923 22.5475 11.6324 24.3264 18.2489 179.0394 1047.2589 2.6773 281.9267 252.1996 93.4986 358.1479 124.5909 114.7066 41.3483 3.3854 16.5988 44.1448 17.4806 9.2790 50.6488 18.5624 18.2040 24.0691 3.1680 15.1988 14.0357 32.0671 10.5637 22.8303 14.2399 31.4628 35.1013 18.9536 9.8705 25.0169 85.0236
temp: 298.150 k
press: 1.00000 atm
elementType: 8 8 8 6 6 6 6 6 6 6 6 6 6 6 6 6 6 6 6 6 6 6 6 1 1 1 1 1 1 1 1 1 1 1 1 1 1 1 1 1 1 1 1 1 1 1 1
symmnumber: 1
zpe: 1009764.6 jmol-1
zpe.correction: 0.384599 hartree
zpe.thermalcorrener: 0.410292 hartree
zpe.thermalcorrenthalpy: 0.411236 hartree
zpe.thermalcorrgfe: 0.324960 hartree
zpe.sumelectzpe: -1000.468109 hartree
zpe.sumelectthermal: -1000.442416 hartree
zpe.sumelectthermalent: -1000.441472 hartree
zpe.sumelectthermalfe: -1000.527748 hartree
dipole: 7.1135 -0.9441 0.2068
dipole: 7.1788
quadrupole: -154.5998 -118.9713 -144.0340
quadrupole: -11.7871 0.8950 -0.4018
quadrupole: -15.3981 20.2304 -4.8323 -11.7871 0.8950 -0.4018
hfenergy: -1000.8527084 hartree
pointgroup: C01 [X(C20H24O3)]
dipole: 2.7961141 0.3955065 -0.0490261 debye
polarizability: 830.8215054|-26.7380366|265.2473947|4.7426593|2.547803|115.5318304 unknown
InChI: InChI=1S/C20H24O3/c1-14(7-6-8-15(2)11-20(21)22)9-10-18-12-17(4)19(23-5)13-16(18)3/h6-13,21H,1-5H3
charge 0 multiplicity 1
47 atoms
O  7.040261 0.78545 0.149851
O  -7.952552 2.517573 0.162046
O  -8.450806 0.264695 -0.113459
C  2.865001 0.016669 -0.011818
C  3.322108 1.374813 -0.093635
C  5.226887 -0.766712 0.179837
C  3.84737 -1.014654 0.12604
C  5.652402 0.594385 0.091862
C  4.710148 1.640421 -0.040381
C  1.433141 -0.281783 -0.067651
C  2.359273 2.543733 -0.239568
C  6.247266 -1.87558 0.32792
C  0.839689 -1.528393 -0.056524
C  -0.591968 -1.830686 -0.101772
C  -1.574513 -0.845352 -0.024213
C  -0.921127 -3.310716 -0.233658
C  7.550309 2.156651 0.063244
C  -2.999421 -1.030946 -0.083519
C  -3.907274 0.014807 0.006087
C  -5.355507 -0.114098 -0.054559
C  -5.972405 -1.489825 -0.234089
C  -6.109976 1.048444 0.055588
C  -7.56737 1.158881 0.0193
H  3.518767 -2.057224 0.200266
H  5.046127 2.680277 -0.104374
H  0.772872 0.591607 -0.135005
H  2.90835 3.499179 -0.284348
H  1.753282 2.466353 -1.161842
H  1.655198 2.606976 0.611596
H  5.754968 -2.861625 0.379235
H  6.957107 -1.88016 -0.519444
H  6.855789 -1.738416 1.240622
H  1.49063 -2.414094 -0.027975
H  -1.2455 0.196568 0.10081
H  -0.506244 -3.718481 -1.175813
H  -0.458107 -3.882308 0.593917
H  -2.000479 -3.523057 -0.222415
H  7.180585 2.776134 0.903016
H  7.270534 2.628391 -0.898434
H  8.644055 2.060417 0.125963
H  -3.38911 -2.04859 -0.208967
H  -3.511586 1.034096 0.132256
H  -7.069086 -1.430856 -0.271071
H  -5.680258 -2.155751 0.599867
H  -5.608816 -1.956818 -1.168917
H  -5.591877 2.0058 0.183858
H  -8.946435 2.556705 0.132973
