program: Gaussian 09
title: 000148973
version: EM64L-G09RevD.01
frameworkgroup: C1[X(C15H20N2O3)]
method: RPBEPBE
basis: SDD
operation: Freq
keyword: #p
keyword: freq=noraman
keyword: PBEPBE/SDD
title: #p freq=noraman PBEPBE/SDD
converged: YES YES NO NO
title: Mulliken charges:
elementType: O O O N N C C C C C C C C C C C C C C C H H H H H H H H H H H H H H H H H H H H
charge: -0.226196 -0.285062 -0.282855 -0.112800 -0.397793 -0.168002 -0.374503 -0.595307 0.146910 -0.698781 0.221843 0.511380 -0.386600 -0.400550 0.373442 -0.364943 -0.397262 0.023797 -0.688998 -0.691487 0.258704 0.229234 0.239285 0.226580 0.267671 0.209186 0.258225 0.218496 0.353485 0.265445 0.228483 0.240185 0.250072 0.196820 0.213437 0.244470 0.228770 0.205113 0.234533 0.225575
chargesum: 0.00000
title: Mulliken charges with hydrogens summed into heavy atoms:
elementType: O O O N N C C C C C C C C C C C C C C C
charge: -0.226196 -0.285062 -0.282855 -0.112800 -0.044309 0.090702 0.094016 -0.101056 0.146910 -0.012874 0.221843 0.511380 -0.121155 -0.172068 0.373442 -0.124757 -0.147190 0.220617 -0.002321 -0.026267
polarizability: 2.40624705e+02 -2.32484579e+00 1.67501349e+02 5.64117198e+00 1.34095525e+01 1.53297276e+02
1716.lowfreq: -4.3312 0.0007 0.0010 0.0011 1.2914 12.5830 19.6743 24.7990 34.6365
frequency: 19.6183 24.7564 34.5878 50.9586 72.4694 84.6199 106.8867 129.5161 155.8084 169.2608 175.8828 182.2570 212.0684 233.8973 262.8543 267.6037 288.2320 320.0093 336.2354 353.5537 378.6760 389.4387 407.9256 416.1090 432.2104 459.0531 486.6762 529.1785 571.9170 590.4654 630.6651 648.2782 680.8961 709.1000 721.1940 727.6755 749.5525 762.0457 800.7272 818.2827 827.7338 846.0456 851.8554 905.4753 921.2762 926.7874 934.8165 941.2898 951.8783 963.9591 968.6496 1002.9831 1059.9716 1090.9830 1105.1087 1115.5558 1130.2562 1149.5064 1150.6694 1157.2491 1176.9493 1186.1115 1211.5693 1224.5507 1230.2817 1243.8556 1272.1260 1274.1195 1308.8738 1320.5935 1321.4182 1342.4817 1351.1232 1355.2742 1367.3811 1380.3622 1382.2374 1392.8660 1397.2612 1419.4087 1423.8118 1455.5864 1458.7015 1466.8484 1468.9560 1469.2470 1480.0165 1486.8662 1488.5011 1497.6299 1581.7695 1620.3595 1631.7269 1647.5079 2957.3241 2973.8775 2974.3519 2988.4726 2993.5492 2994.1001 3002.5085 3053.1333 3076.0398 3084.5582 3085.9865 3093.2637 3095.5030 3102.5916 3110.4994 3114.0999 3131.1884 3163.1801 3166.1549 3524.3585
redmass: 3.9673 4.4480 4.5828 4.4238 6.1736 3.0706 3.6759 3.5704 4.7406 2.0131 1.0770 1.5185 2.2357 1.5095 3.2315 3.1002 3.8582 3.7355 3.0904 3.3596 6.1957 2.2346 3.4344 3.0323 4.7203 2.7622 4.6385 3.7644 4.0545 3.9146 6.3718 3.5806 3.0277 4.0125 4.4251 4.2045 3.9728 1.7481 3.1004 3.2964 1.2905 1.9384 3.2522 1.5392 1.9358 1.6980 1.6022 1.3421 1.4405 1.6400 1.3916 2.7822 2.1305 2.0083 1.7931 2.0238 1.7247 2.0511 2.0015 2.1102 1.4723 1.7610 2.1616 3.2068 2.8730 1.8245 1.5883 1.4959 1.3432 1.3240 1.4289 1.3667 2.1668 1.4010 1.7961 1.9001 1.9060 1.2335 1.2455 3.0869 2.4050 1.0503 1.0976 1.0490 1.0502 1.0502 1.0576 1.0598 1.1411 2.5056 6.9523 6.4618 10.4052 5.0268 1.0709 1.0777 1.0847 1.0358 1.0365 1.0362 1.0636 1.0961 1.0998 1.0994 1.1003 1.1001 1.0997 1.1004 1.0991 1.0897 1.0900 1.0937 1.0945 1.0767
irintensity: 1.2188 0.6039 3.5566 1.2634 0.0083 0.1364 0.5797 0.7031 3.3049 3.2371 0.2466 1.7634 3.2478 1.1173 1.4631 5.7362 2.5235 7.7761 0.1164 3.5216 16.8598 2.8781 11.9776 3.4572 6.6754 3.5184 2.3440 25.2833 5.6944 23.8109 1.3232 17.1812 5.2951 0.1929 11.4216 0.6455 15.4070 99.6899 32.2155 4.4151 1.1668 40.8456 27.7242 7.6778 26.8975 29.9371 2.9864 0.0736 0.6761 1.2945 1.7711 5.4129 7.3257 6.1080 71.4690 20.1951 24.7921 14.4029 5.7941 30.0859 21.2141 178.8808 13.2130 307.4347 192.3861 93.2633 33.4380 12.6817 19.1216 11.2948 19.0093 7.3533 61.0553 22.7103 3.0055 21.5095 27.9211 25.6819 28.6599 72.4092 103.7000 5.5582 30.6713 2.4675 10.7362 7.1641 11.0220 15.2637 47.5206 138.9062 6.5073 93.8765 240.5579 421.8414 13.9373 30.5770 27.2882 16.2164 25.4194 25.8066 36.2580 14.7203 2.8478 11.4787 32.2973 33.7830 34.8013 36.7685 12.5526 19.3374 4.0999 13.4393 8.3556 48.9632
temp: 298.150 k
press: 1.00000 atm
elementType: 8 8 8 7 7 6 6 6 6 6 6 6 6 6 6 6 6 6 6 6 1 1 1 1 1 1 1 1 1 1 1 1 1 1 1 1 1 1 1 1
symmnumber: 1
zpe: 863789.4 jmol-1
zpe.correction: 0.329000 hartree
zpe.thermalcorrener: 0.348959 hartree
zpe.thermalcorrenthalpy: 0.349904 hartree
zpe.thermalcorrgfe: 0.278596 hartree
zpe.sumelectzpe: -917.306086 hartree
zpe.sumelectthermal: -917.286126 hartree
zpe.sumelectthermalent: -917.285182 hartree
zpe.sumelectthermalfe: -917.356490 hartree
dipole: -3.3321 2.0836 1.4495
dipole: 4.1888
quadrupole: -122.3909 -125.6665 -116.1591
quadrupole: 7.4287 20.8727 5.9043
quadrupole: -0.9854 -4.2610 5.2464 7.4287 20.8727 5.9043
hfenergy: -917.6350859 hartree
pointgroup: C01 [X(C15H20N2O3)]
dipole: 1.3003302 -0.5872442 0.824705 debye
polarizability: 239.210903|-10.7797298|155.6017754|-7.3663818|-13.3656815|166.6106518 unknown
InChI: InChI=1S/C15H20N2O3/c1-10(2)20-13-6-4-12(5-7-13)9-17-8-11(3)14(18)16-15(17)19/h4-7,10-11,16H,8-9H2,1-3H3
charge 0 multiplicity 1
40 atoms
O  -5.313699 -0.955609 -1.361882
O  -2.116772 2.415764 -1.286578
O  4.083161 -1.125205 0.2547
N  -2.09481 0.879202 0.496021
N  -3.612881 0.622934 -1.306634
C  -3.977118 -0.748961 0.71453
C  -2.473374 -0.479874 0.937837
C  -0.947725 1.557022 1.155378
C  -4.371822 -0.406678 -0.729885
C  -4.365548 -2.195875 1.0729
C  -2.556463 1.377034 -0.709216
C  0.389665 0.871902 0.897492
C  1.005222 0.95432 -0.376183
C  1.045546 0.131864 1.914569
C  2.876024 -0.426433 0.389754
C  2.236168 0.31584 -0.638953
C  2.274362 -0.510451 1.671073
C  4.83111 -1.064382 -1.035057
C  5.587242 0.271221 -1.147829
C  5.763374 -2.279523 -1.006632
H  -4.552005 -0.048429 1.357147
H  -2.238112 -0.567475 2.01339
H  -1.868405 -1.244845 0.406613
H  -1.157731 1.593428 2.240996
H  -0.939515 2.589425 0.766081
H  -4.218816 -2.384373 2.151448
H  -5.421842 -2.379374 0.818666
H  -3.75462 -2.920541 0.504797
H  -3.894456 0.94916 -2.236639
H  0.515685 1.532285 -1.169276
H  0.594863 0.062908 2.913099
H  2.681614 0.4086 -1.633681
H  2.786299 -1.082191 2.451126
H  4.104237 -1.173728 -1.866557
H  6.129414 0.322572 -2.109887
H  4.904935 1.136472 -1.090524
H  6.322761 0.357678 -0.328755
H  6.358086 -2.326973 -1.936601
H  5.183542 -3.212992 -0.909705
H  6.456104 -2.210419 -0.149642
