program: Gaussian 09
title: 000148957
version: EM64L-G09RevD.01
frameworkgroup: C1[X(C13H15N5O5)]
method: RPBEPBE
basis: SDD
operation: Freq
keyword: #p
keyword: freq=noraman
keyword: PBEPBE/SDD
title: #p freq=noraman PBEPBE/SDD
converged: NO YES NO NO
title: Mulliken charges:
elementType: O O O O O N N N N N C C C C C C C C C C C C C H H H H H H H H H H H H H H H
charge: -0.302916 -0.298356 -0.125046 -0.232165 -0.191147 -0.136786 -0.161640 -0.087794 0.008582 0.014131 -0.367113 -0.468250 -0.454164 -0.326170 0.401287 -0.057275 0.308210 -0.331425 -0.048483 -0.425950 0.404385 -0.209573 -0.672142 0.241184 0.250377 0.325341 0.239065 0.287406 0.235005 0.246525 0.246478 0.265080 0.291491 0.229215 0.228840 0.215826 0.228718 0.229249
chargesum: 0.00000
title: Mulliken charges with hydrogens summed into heavy atoms:
elementType: O O O O O N N N N N C C C C C C C C C C C C C
charge: -0.302916 -0.298356 -0.125046 -0.232165 -0.191147 -0.136786 -0.161640 -0.087794 0.008582 0.014131 0.124448 0.096157 0.068247 0.166833 0.401287 -0.057275 0.308210 -0.066345 -0.048483 -0.134459 0.404385 0.248483 0.001651
polarizability: 3.43812272e+02 -6.26110531e+00 1.99759526e+02 -3.13842408e+01 -1.02425698e+01 1.26073827e+02
1716.lowfreq: -9.2194 -4.5483 0.0000 0.0006 0.0007 5.4686 12.6713 23.3345 36.5498
frequency: 12.2351 23.2811 36.4845 48.0294 65.2312 79.2632 105.6324 113.6903 131.7064 140.4040 165.9939 183.7784 194.4729 208.2786 236.6597 252.0711 253.0953 302.0735 318.2888 331.3708 342.0983 360.8706 373.1944 412.9675 443.2960 499.9471 509.3186 515.4434 550.6313 569.2293 580.6724 614.4192 617.8097 638.9008 654.5301 679.5871 698.2935 710.0106 713.3675 739.9507 771.5680 801.0109 814.1879 834.4898 849.9518 854.4757 869.5027 930.0589 960.2511 979.1674 980.8358 989.1555 1008.4659 1032.2737 1067.6705 1071.4408 1089.7910 1110.1740 1113.4732 1139.5547 1155.9039 1169.1576 1203.6583 1220.3204 1223.8991 1233.5652 1250.2166 1251.9475 1278.8835 1287.7349 1304.3723 1320.8345 1331.6776 1347.1379 1352.4686 1363.9795 1369.2609 1379.7498 1393.7395 1403.7958 1421.1269 1450.8570 1464.0722 1473.1223 1476.3909 1477.9424 1484.6781 1490.4723 1499.3801 1512.5554 1567.2062 1584.5983 1638.9219 2964.4930 2974.9753 2986.9196 2996.0613 2997.1838 3012.5757 3022.4130 3050.3908 3071.2132 3084.8387 3088.7193 3093.3534 3107.6263 3167.8060 3195.6839
redmass: 5.5146 3.6647 3.3016 5.8304 10.3417 4.9150 3.6117 4.3638 5.3083 3.9078 6.1593 3.8366 6.6139 7.0678 4.5242 2.4218 1.6274 4.1803 4.0839 3.1867 2.9801 5.2311 3.7297 8.7577 5.9810 3.7527 5.2029 4.9054 4.8442 10.5683 7.0281 5.6181 5.3709 2.3835 5.0452 8.5157 11.1374 8.9106 8.9776 9.3875 5.3522 1.0962 1.4972 3.4053 6.4814 2.6470 2.4879 11.0773 2.1538 1.5808 2.0025 6.2784 2.6607 2.4240 2.6222 2.0593 2.6293 2.2241 2.2012 1.4627 4.1822 3.3896 1.4582 1.5132 1.9409 2.3562 1.2429 1.3999 2.2385 4.2286 2.0613 2.2448 1.8791 1.3642 5.5483 1.4058 1.4120 1.4084 1.8008 1.6331 3.5229 7.8036 1.0406 1.1151 1.0555 1.0886 1.0857 1.0789 1.1082 4.7022 7.2993 7.2769 10.4796 1.0585 1.0698 1.0697 1.0365 1.0584 1.0581 1.1029 1.1041 1.1067 1.0943 1.0979 1.0985 1.1030 1.0898 1.0925
irintensity: 2.3896 1.8864 0.5800 0.4488 0.4779 6.6988 3.2540 1.5203 1.3709 3.4746 1.3429 1.6856 1.2134 0.1242 3.5694 3.9034 3.2926 2.6902 2.5740 3.4231 1.6084 8.2184 5.5297 3.0286 8.9306 1.4745 4.7461 0.2508 0.7480 0.9096 21.6198 0.8399 0.4477 6.0792 0.8347 13.9049 19.5727 10.3308 0.0071 12.2891 8.5480 3.1127 40.9718 5.9946 22.9739 33.7480 13.4355 20.7312 5.1892 12.3048 18.3697 6.3990 34.9416 112.7932 67.0275 1.6611 190.7324 21.7251 22.1934 5.3780 83.8779 283.3413 179.7303 72.1451 20.6884 437.0429 44.3509 82.4422 43.6525 38.0310 52.5943 155.3023 45.6154 9.1354 81.6960 12.6447 5.5006 3.7682 201.1961 53.7523 35.9250 72.3781 12.9529 72.0333 7.2019 33.4346 11.8247 11.1243 11.9936 5.8614 474.3940 222.5904 419.3358 26.4570 17.0305 43.1848 12.6274 29.8390 27.0416 35.3047 30.2893 6.4908 8.3626 14.3721 31.9224 46.0678 2.0751 8.2942
temp: 298.150 k
press: 1.00000 atm
elementType: 8 8 8 8 8 7 7 7 7 7 6 6 6 6 6 6 6 6 6 6 6 6 6 1 1 1 1 1 1 1 1 1 1 1 1 1 1 1
symmnumber: 1
zpe: 747019.8 jmol-1
zpe.correction: 0.284525 hartree
zpe.thermalcorrener: 0.305375 hartree
zpe.thermalcorrenthalpy: 0.306319 hartree
zpe.thermalcorrgfe: 0.232046 hartree
zpe.sumelectzpe: -1152.401324 hartree
zpe.sumelectthermal: -1152.380474 hartree
zpe.sumelectthermalent: -1152.379530 hartree
zpe.sumelectthermalfe: -1152.453803 hartree
dipole: 9.3713 -1.8212 -1.8632
dipole: 9.7268
quadrupole: -188.0130 -139.6141 -129.1589
quadrupole: 19.6222 11.9639 4.6542
quadrupole: -35.7510 12.6479 23.1031 19.6222 11.9639 4.6542
hfenergy: -1152.6858489 hartree
pointgroup: C01 [X(C13H15N5O5)]
dipole: 3.6397967 0.5555836 1.0428897 debye
polarizability: 340.3057151|-0.4070297|200.6595275|42.158465|6.230999|128.6803826 unknown
InChI: InChI=1S/C13H15N5O5/c1-2-22-13(19)17-7-5-16(6-8-17)9-3-4-10(18(20)21)12-11(9)14-23-15-12/h3-4H,2,5-8H2,1H3
charge 0 multiplicity 1
38 atoms
O  5.034725 -0.353401 -0.599252
O  5.174931 1.751625 0.454278
O  -2.489206 -2.877482 -0.2002
O  -5.489117 1.875813 -1.366678
O  -5.720745 -0.403827 -1.397516
N  0.415726 0.324561 0.713862
N  3.268771 0.389301 0.647162
N  -1.332324 -2.13055 0.178854
N  -3.589707 -2.014146 -0.60898
N  -5.034634 0.672002 -1.181608
C  1.138891 1.608583 0.942265
C  1.19715 -0.909767 0.984774
C  2.55236 1.355633 1.493329
C  2.565646 -0.861805 0.279729
C  -0.886281 0.3638 0.263726
C  -1.690719 -0.830299 0.016974
C  4.541065 0.692484 0.196558
C  -1.55223 1.595614 0.004997
C  -3.074025 -0.757416 -0.463835
C  -2.887518 1.662668 -0.458752
C  -3.668472 0.524691 -0.702074
C  6.411326 -0.139383 -1.139129
C  6.750042 -1.372322 -1.970253
H  0.573663 2.235576 1.660809
H  1.207495 2.162859 -0.01495
H  0.635465 -1.789769 0.640558
H  1.335051 -1.016934 2.078893
H  3.12668 2.296569 1.492161
H  2.502259 0.999978 2.5416
H  3.160132 -1.74381 0.581769
H  2.436318 -0.915522 -0.817223
H  -1.027669 2.539347 0.159634
H  -3.35194 2.636032 -0.644479
H  6.410567 0.78832 -1.738924
H  7.10166 0.000508 -0.288064
H  7.764905 -1.266728 -2.394818
H  6.726882 -2.285701 -1.35153
H  6.03728 -1.4959 -2.803469
