program: Gaussian 09
title: 000148937
version: EM64L-G09RevD.01
frameworkgroup: C1[X(C6H2Cl3N3)]
method: RPBEPBE
basis: SDD
operation: Freq
keyword: #p
keyword: freq=noraman
keyword: PBEPBE/SDD
title: #p freq=noraman PBEPBE/SDD
converged: YES YES NO NO
title: Mulliken charges:
elementType: Cl Cl Cl N N N C C C C C C H H
charge: -0.002594 0.014988 -0.020997 -0.041842 0.003640 -0.029775 0.483872 -0.203685 -0.245065 -0.217524 -0.215488 -0.100517 0.286710 0.288278
chargesum: 0.00000
title: Mulliken charges with hydrogens summed into heavy atoms:
elementType: Cl Cl Cl N N N C C C C C C
charge: -0.002594 0.014988 -0.020997 -0.041842 0.003640 -0.029775 0.483872 -0.203685 -0.245065 0.069186 0.072790 -0.100517
polarizability: 2.01720541e+02 6.79406583e+00 1.29490209e+02 -1.16776703e-02 -3.67544279e-03 4.02643273e+01
1716.lowfreq: -6.0381 -0.0024 0.0026 0.0030 0.9183 4.2270 27.3420 101.4427 129.0595
frequency: 27.3408 101.4415 129.0593 131.1697 173.6830 191.1447 197.6457 268.5935 324.1975 339.8438 347.4190 411.8756 448.6563 498.8979 501.8625 549.9977 565.9628 670.4033 713.2129 759.3049 803.4083 854.0863 865.6900 1025.8484 1108.4213 1134.7296 1186.4942 1328.6855 1353.2382 1384.5682 1448.2542 1542.8594 1576.4939 2063.6597 3186.0273 3191.5151
redmass: 18.0975 15.9957 12.2213 16.1051 24.9142 25.7239 4.8422 15.8488 9.3462 15.7872 31.2835 8.2008 13.8349 5.3149 9.7963 4.2628 8.0613 10.9180 6.5540 11.4682 8.9656 1.3962 1.3552 5.6767 1.9850 6.9475 1.5334 4.7029 3.5690 5.4114 5.8824 9.5833 8.2051 13.9863 1.0935 1.0937
irintensity: 0.0174 0.3864 0.4402 0.1969 0.5372 0.1284 0.0013 0.8459 0.0167 6.1110 0.1130 5.4547 2.0475 0.0073 3.4339 7.3816 28.9622 6.2766 12.9072 79.2251 37.7140 35.3002 6.1406 2.8405 21.2320 2.1899 8.0327 18.3985 27.5407 11.5546 251.1709 59.1735 21.3093 595.5751 2.2569 1.3588
temp: 298.150 k
press: 1.00000 atm
elementType: 17 17 17 7 7 7 6 6 6 6 6 6 1 1
symmnumber: 1
zpe: 187847.8 jmol-1
zpe.correction: 0.071547 hartree
zpe.thermalcorrener: 0.082728 hartree
zpe.thermalcorrenthalpy: 0.083672 hartree
zpe.thermalcorrgfe: 0.032475 hartree
zpe.sumelectzpe: -1773.359323 hartree
zpe.sumelectthermal: -1773.348143 hartree
zpe.sumelectthermalent: -1773.347199 hartree
zpe.sumelectthermalfe: -1773.398395 hartree
dipole: 1.5141 -0.4402 0.0001
dipole: 1.5768
quadrupole: -96.7467 -87.8537 -89.3336
quadrupole: 0.3523 0.0030 0.0015
quadrupole: -5.4353 3.4576 1.9777 0.3523 0.0030 0.0015
hfenergy: -1773.4308707 hartree
pointgroup: C01 [X(C6H2Cl3N3)]
dipole: -0.6135121 -0.0919367 0.0025136 debye
dipolederiv: -0.2184722 0.2409554 -0.0185586 0.1569947 -0.5296722 0.0373616 -0.0124639 0.0380103 -0.0243296 -0.1513243 -0.198382 0.0130601 -0.2020273 -0.6467365 0.0428055 0.0133362 0.0426546 -0.0220274 -0.9025279 -0.0340022 -0.0031807 -0.0667324 -0.122253 0.0052744 -0.0008451 0.0054946 -0.0421133 -1.4109534 0.3573388 -0.0329456 0.8047481 -0.3521826 0.0202648 -0.064759 0.0175972 -0.1354662 1.6636184 -0.6557918 0.0554284 -1.1919567 0.5680258 -0.0388896 0.0932741 -0.0356589 0.1222386 -1.1067585 0.3073073 -0.0278716 0.5113753 -0.2276214 0.0141573 -0.0421962 0.0128826 -0.072179 1.1209637 -0.0243763 0.0072741 -0.0773931 -0.3824482 0.0379185 0.0111491 0.0381841 0.1571529 0.2105736 -0.3023201 0.0238842 -0.2989671 0.7823887 -0.0632134 0.0233135 -0.0632363 -0.0681027 0.1527996 0.2951163 -0.0189402 0.3664946 1.0003352 -0.0733366 -0.0241037 -0.0735853 -0.0736759 -0.450219 0.0685332 -0.0075606 0.1185898 -0.190052 0.0106011 -0.0110437 0.0103325 -0.0538141 -0.343942 -0.144345 0.0082454 -0.1685756 -0.2288514 0.0106595 0.0101753 0.0106567 -0.0609912 1.2686702 0.0775928 0.0032192 0.040222 0.226837 -0.0209888 0.0059172 -0.0207516 -0.0720787 0.0833374 -0.0182553 0.0007128 -0.0271788 0.0462683 0.0088259 0.0013201 0.0089105 0.1725004 0.0842344 0.0306289 -0.0027669 0.0344064 0.0559621 0.0085598 -0.0030739 0.008509 0.1728862 unknown
polarizability: 198.6178315|-16.0201647|132.1127183|2.1383307|-6.5977135|40.7445271 unknown
InChI: InChI=1S/C6H2Cl3N3/c7-3-1-4(8)6(11-12-10)5(9)2-3/h1-2H
charge 0 multiplicity 1
14 atoms
Cl 0.853365 -2.576044 0.216159
Cl 0.400569 3.000142 -0.181759
Cl -4.123585 -0.181493 0.01277
N  1.899542 0.490903 0.003789
N  2.837047 -0.357659 0.069286
N  3.887383 -0.903702 0.114016
C  0.516679 0.215295 0.014575
C  -0.130451 -1.053291 0.100554
C  -0.339736 1.355623 -0.071456
C  -1.530492 -1.189132 0.101075
C  -1.739456 1.254153 -0.07337
C  -2.317498 -0.02691 0.013476
H  -1.987722 -2.178933 0.168386
H  -2.358545 2.151049 -0.1410
