program: Gaussian 09
title: 000148940
version: EM64L-G09RevD.01
frameworkgroup: C1[X(C16H16O)]
method: RPBEPBE
basis: SDD
operation: Freq
keyword: #pfreq=noraman
keyword: PBEPBE/SDD
title: #p freq=noraman PBEPBE/SDD
converged: YES YES NO NO
title: Mulliken charges:
elementType: O C C C C C C C C C C C C C C C C H H H H H H H H H H H H H H H H
charge: -0.298311 -0.003695 -0.427931 -0.369956 -0.583430 0.512478 -0.421406 -0.416739 0.345175 -0.397986 -0.399644 0.342011 -0.398698 -0.397633 -0.235373 -0.235702 -0.242601 0.228099 0.219964 0.233351 0.217940 0.213394 0.208495 0.217148 0.231075 0.230164 0.236851 0.237151 0.237669 0.238269 0.225153 0.225268 0.229451
chargesum: 0.00000
title: Mulliken charges with hydrogens summed into heavy atoms:
elementType: O C C C C C C C C C C C C C C C C
charge: -0.298311 0.224404 0.025384 0.061378 -0.157788 0.512478 -0.190331 -0.186576 0.345175 -0.161135 -0.162493 0.342011 -0.161029 -0.159364 -0.010220 -0.010434 -0.013150
polarizability: 2.85470627e+02 3.99866530e+00 1.58147177e+02 1.79659031e+01 -7.66133783e+00 9.80644921e+01
1716.lowfreq: -8.2620 -5.2203 -0.0005 0.0005 0.0006 6.7984 13.4308 30.5447 46.0098
frequency: 12.0835 30.4924 45.9919 68.2321 79.5441 97.1127 119.1723 179.6728 207.1851 283.7091 309.4276 352.5084 382.8087 401.4747 404.8982 409.9000 444.9653 505.3215 557.2315 588.4210 614.7969 639.5666 701.3099 702.1167 731.6896 745.9955 767.9495 770.9939 797.6154 816.0833 846.5201 847.9174 850.8712 898.5204 918.9967 955.4088 970.4043 972.5187 973.6021 988.5609 993.1808 996.4133 1004.9666 1018.4429 1029.4955 1041.3004 1061.3734 1084.6702 1099.7887 1118.8763 1130.9634 1173.2104 1185.9800 1190.1337 1200.3992 1222.7367 1233.1305 1255.8446 1279.2470 1290.3486 1304.7691 1320.0313 1330.5481 1365.9161 1374.5014 1393.7065 1412.4704 1438.8342 1466.3833 1477.4954 1480.7208 1485.0138 1517.9843 1568.3835 1588.8615 1613.2757 1623.3622 2978.3928 2997.7960 3028.0776 3055.4822 3058.6975 3077.0378 3113.7100 3115.8578 3122.2122 3126.7464 3139.5986 3140.5613 3147.1789 3148.6606 3163.1457 3164.6927
redmass: 4.2412 5.9201 2.7747 3.6752 3.2696 5.0924 3.7222 4.0582 5.3558 3.9472 3.3583 4.1566 3.1648 2.8111 2.8621 2.8752 3.7626 3.3553 2.9479 4.2813 6.4308 6.6964 4.2096 1.9227 3.7453 4.2506 1.8251 1.7549 2.1144 3.7072 1.7321 1.2572 1.3052 1.3101 1.4429 1.4274 1.5432 1.5192 1.4488 4.8924 1.3141 6.5883 2.4322 2.6315 1.7995 1.8987 1.5714 1.6126 1.2951 1.3029 1.3392 1.0525 1.5361 1.1084 1.1475 2.1721 1.5285 1.2860 1.3095 3.0068 1.4542 1.2935 1.4457 2.6652 8.9250 1.9652 3.5742 2.3925 1.1378 2.1693 1.1812 1.1040 2.9041 5.8945 6.5022 6.0509 6.4127 1.0593 1.0601 1.1008 1.0831 1.0678 1.0952 1.0877 1.0877 1.0844 1.0875 1.0924 1.0947 1.0959 1.0962 1.1186 1.1016
irintensity: 1.2151 0.3337 1.2933 0.0780 2.7503 1.8319 0.2706 3.9869 0.4969 1.2674 0.2393 3.0257 4.0019 6.8509 1.8953 0.0892 3.2072 21.6825 7.5907 5.1102 0.0372 0.1938 10.8069 43.7942 12.6548 13.4017 17.4799 52.8055 28.8692 5.8512 40.2650 2.4368 3.7840 1.2684 2.0385 1.7686 3.8060 2.0883 0.4010 0.4374 0.0665 10.1650 1.1312 0.0568 4.5012 5.2802 3.4632 8.2928 4.3268 11.1625 4.1190 0.0290 7.5883 1.1856 0.4599 0.1198 8.6112 1.0387 2.7284 0.0231 4.0698 0.2783 1.3766 2.2855 0.0149 19.8419 4.5233 3.9461 2.4004 58.6601 2.8151 13.1412 12.8064 1.1240 1.4035 11.0345 1.1131 29.8489 27.7532 5.8184 0.2568 46.8836 40.5777 9.3243 36.1553 3.6130 1.8185 15.0781 19.6090 0.8907 49.5719 41.9642 24.8476
temp: 298.150 k
press: 1.00000 atm
elementType: 8 6 6 6 6 6 6 6 6 6 6 6 6 6 6 6 6 1 1 1 1 1 1 1 1 1 1 1 1 1 1 1 1
symmnumber: 1
zpe: 711432.3 jmol-1
zpe.correction: 0.270970 hartree
zpe.thermalcorrener: 0.286007 hartree
zpe.thermalcorrenthalpy: 0.286951 hartree
zpe.thermalcorrgfe: 0.225655 hartree
zpe.sumelectzpe: -693.273898 hartree
zpe.sumelectthermal: -693.258861 hartree
zpe.sumelectthermalent: -693.257917 hartree
zpe.sumelectthermalfe: -693.319214 hartree
dipole: -0.9123 0.6496 2.0994
dipole: 2.3795
quadrupole: -101.0843 -90.2212 -108.2661
quadrupole: 4.4564 16.6147 -4.1898
quadrupole: -1.2271 9.6360 -8.4089 4.4564 16.6147 -4.1898
hfenergy: -693.5448687 hartree
pointgroup: C01 [X(C16H16O1)]
dipole: 0.3586802 0.6613918 -0.5570414 debye
polarizability: 285.4949748|-14.2425676|133.5177423|11.2379252|30.6193914|122.6695795 unknown
InChI: InChI=1S/C16H16O/c1-2-4-14(5-3-1)15-9-6-13(7-10-15)8-11-16-12-17-16/h1-7,9-10,16H,8,11-12H2
charge 0 multiplicity 1
33 atoms
O  -6.189878 -1.088178 0.793881
C  -5.290813 0.093153 0.495309
C  -3.797735 -0.171886 0.503312
C  -6.185546 -0.453446 -0.576286
C  -3.01003 0.967667 -0.209522
C  -1.507607 0.733618 -0.180172
C  -0.70783 1.232417 0.879519
C  -0.866812 -0.029891 -1.189427
C  1.322163 0.211791 -0.079599
C  0.67771 0.977309 0.930781
C  0.518612 -0.285601 -1.142413
C  2.788623 -0.055696 -0.029021
C  3.689787 0.901323 0.515341
C  3.327919 -1.276137 -0.522916
C  5.077003 0.647783 0.566052
C  4.715133 -1.530344 -0.475778
C  5.598281 -0.569803 0.070033
H  -5.615715 1.01235 1.006144
H  -3.592705 -1.139188 0.007508
H  -3.444032 -0.268679 1.54766
H  -7.108166 0.07633 -0.844455
H  -5.747706 -1.077239 -1.36712
H  -3.252724 1.931372 0.280114
H  -3.364126 1.041783 -1.256111
H  -1.177174 1.823077 1.676453
H  -1.457619 -0.415374 -2.030044
H  1.261939 1.352485 1.778787
H  0.989349 -0.848012 -1.956921
H  3.304669 1.863052 0.873035
H  2.652475 -2.043859 -0.917271
H  5.752279 1.403759 0.982623
H  5.106061 -2.481414 -0.854823
H  6.675316 -0.767022 0.108125
