program: Gaussian 09
title: 000148933
version: EM64L-G09RevD.01
frameworkgroup: C1[X(C13H12O2)]
method: RPBEPBE
basis: SDD
operation: Freq
keyword: #pfreq=noraman
keyword: PBEPBE/SDD
title: #p freq=noraman PBEPBE/SDD
converged: YES YES NO NO
title: Mulliken charges:
elementType: O O C C C C C C C C C C C C C H H H H H H H H H H H H
charge: -0.296030 -0.279176 -0.055252 -0.350398 -0.305707 0.243923 0.142479 0.434776 -0.387340 -0.373047 -0.453177 -0.241577 -0.421511 -0.236444 -0.238479 0.250524 0.223775 0.228283 0.226300 0.218634 0.248832 0.266278 0.237621 0.237689 0.224596 0.227580 0.226850
chargesum: 0.00000
title: Mulliken charges with hydrogens summed into heavy atoms:
elementType: O O C C C C C C C C C C C C C
charge: -0.296030 -0.279176 0.195273 0.101660 0.139226 0.243923 0.142479 0.434776 -0.138508 -0.106770 -0.215556 -0.016981 -0.183822 -0.008864 -0.011629
polarizability: 1.95212678e+02 1.15018249e+01 1.73141008e+02 -1.01348435e+00 8.01883839e-01 7.36701733e+01
1716.lowfreq: -9.4718 -0.0002 0.0005 0.0005 1.9631 7.4122 36.9798 51.2637 87.1345
frequency: 36.9383 51.2167 87.1091 107.5207 145.9925 184.0818 221.5888 246.2415 262.0508 378.8207 409.2242 419.9242 464.2672 471.8709 502.0030 530.9744 573.4075 603.2175 641.8584 705.5839 742.0811 758.7035 782.3619 782.8778 799.2115 808.6279 850.9190 865.2266 892.1663 901.5036 951.3669 962.7103 975.7884 978.8190 995.4179 1022.3797 1029.0251 1060.8148 1086.2721 1098.4382 1113.5430 1140.6645 1147.2847 1171.2180 1185.5425 1211.7899 1231.8546 1237.4551 1239.5642 1268.2749 1349.9096 1375.3236 1404.4362 1413.9342 1427.5556 1440.5174 1453.6630 1474.2165 1485.9663 1516.7244 1583.9197 1597.3011 1636.1709 2967.8965 3030.9794 3072.7029 3115.5721 3121.9955 3128.9219 3136.1430 3149.8685 3155.3052 3169.9847 3174.0315 3182.5948
redmass: 5.5990 3.5268 4.0872 3.3655 4.6843 3.9993 5.8690 4.3825 4.3678 5.0261 2.1784 3.1133 5.1685 3.2996 6.9029 6.1849 3.2562 6.7404 3.2433 6.4243 1.3259 7.4840 3.5299 1.9080 4.2752 1.9145 4.9521 1.4433 1.5828 1.2319 5.1279 1.3421 1.4194 1.7209 1.3287 2.5483 1.4359 3.1171 2.2840 1.3708 1.3326 1.5522 1.4348 1.0768 1.2672 1.3274 1.7588 1.4865 2.1948 1.7919 1.3367 2.2669 3.1175 1.9997 5.3455 2.4842 2.4907 1.2075 1.1503 3.8804 7.0456 5.6748 6.9737 1.0558 1.1069 1.0531 1.0920 1.0861 1.0861 1.0901 1.0940 1.0961 1.0960 1.0973 1.1192
irintensity: 0.4869 1.8421 1.7150 5.8828 5.3090 1.0150 9.8735 3.9505 0.5476 4.6980 0.3551 6.6542 7.6091 0.0571 0.3386 2.9138 10.8840 3.2283 0.8347 9.7706 1.2651 8.7566 22.3589 73.9351 34.4762 69.4989 2.3384 0.3206 3.6309 6.4604 23.9747 0.5292 7.9849 14.4405 0.0095 24.4828 0.2219 100.5939 60.4242 6.2575 9.8990 2.3147 6.3230 2.2529 12.6522 26.4840 30.0199 10.1038 99.5904 35.2218 24.9289 17.4953 27.4149 1.3264 27.0192 4.1128 34.6835 5.4931 5.9369 27.5240 72.6219 5.5905 4.3727 33.4497 26.4342 22.2640 14.6829 1.0565 1.1158 15.2367 30.3564 33.6265 20.0223 12.1241 27.3594
temp: 298.150 k
press: 1.00000 atm
elementType: 8 8 6 6 6 6 6 6 6 6 6 6 6 6 6 1 1 1 1 1 1 1 1 1 1 1 1
symmnumber: 1
zpe: 561655.3 jmol-1
zpe.correction: 0.213923 hartree
zpe.thermalcorrener: 0.226430 hartree
zpe.thermalcorrenthalpy: 0.227374 hartree
zpe.thermalcorrgfe: 0.173921 hartree
zpe.sumelectzpe: -651.909800 hartree
zpe.sumelectthermal: -651.897294 hartree
zpe.sumelectthermalent: -651.896349 hartree
zpe.sumelectthermalfe: -651.949802 hartree
dipole: -0.7954 -0.4072 0.4908
dipole: 1.0195
quadrupole: -90.8916 -76.7167 -90.1746
quadrupole: -4.6785 2.0437 0.0077
quadrupole: -4.9640 9.2109 -4.2470 -4.6785 2.0437 0.0077
hfenergy: -652.1237233 hartree
pointgroup: C01 [X(C13H12O2)]
dipole: -0.308143 0.15876 -0.2017778 debye
polarizability: 194.4104922|-12.1695642|173.6768092|1.2518087|-5.2914229|73.9365581 unknown
InChI: InChI=1S/C13H12O2/c1-2-6-12-10(4-1)5-3-7-13(12)15-9-11-8-14-11/h1-7,11H,8-9H2
charge 0 multiplicity 1
27 atoms
O  5.03459 -0.136688 0.156439
O  1.298185 0.205467 0.237136
C  3.668444 0.443166 0.437078
C  4.414976 0.875137 -0.784729
C  2.545912 -0.56655 0.347596
C  0.092623 -0.517203 0.180925
C  -1.096224 0.296835 0.098306
C  -2.380813 -0.366781 0.034223
C  0.012505 -1.91487 0.199887
C  -1.039081 1.727295 0.077026
C  -2.440034 -1.801137 0.055607
C  -1.267389 -2.550394 0.136477
C  -3.564802 0.438624 -0.049064
C  -2.212801 2.482177 -0.004801
C  -3.485944 1.833171 -0.068459
H  3.634456 1.118496 1.300981
H  4.119764 0.472092 -1.761333
H  4.908328 1.853782 -0.79621
H  2.51889 -1.201334 1.256491
H  2.682717 -1.217053 -0.539323
H  0.910807 -2.535553 0.260277
H  -0.060568 2.212929 0.125997
H  -3.416352 -2.296104 0.006945
H  -4.538858 -0.062613 -0.097886
H  -1.313012 -3.644778 0.152375
H  -2.161465 3.576411 -0.020483
H  -4.399051 2.435379 -0.132478
