program: Gaussian 09
title: 000148936
version: EM64L-G09RevD.01
frameworkgroup: C1[X(C11H16N2O4)]
method: RPBEPBE
basis: SDD
operation: Freq
keyword: #p
keyword: freq=noraman
keyword: PBEPBE/SDD
title: #p freq=noraman PBEPBE/SDD
converged: YES YES NO NO
title: Mulliken charges:
elementType: O O O O N N C C C C C C C C C C C H H H H H H H H H H H H H H H H
charge: -0.277210 -0.441763 -0.218385 -0.215764 -0.316148 0.015344 0.431264 -0.499128 0.208268 -0.575184 -0.355032 0.400415 -0.321234 -0.391899 -0.332414 -0.247614 -0.680564 0.207271 0.221574 0.280373 0.291966 0.195576 0.204607 0.255219 0.286268 0.205350 0.210496 0.218605 0.219788 0.218201 0.236322 0.230209 0.335221
chargesum: 0.00000
title: Mulliken charges with hydrogens summed into heavy atoms:
elementType: O O O O N N C C C C C C C C C C C
charge: -0.277210 -0.106542 -0.218385 -0.215764 -0.035775 0.015344 0.431264 -0.070282 0.208268 -0.283218 0.045151 0.400415 -0.066015 -0.105631 0.083433 0.190779 0.004168
polarizability: 2.16968113e+02 2.46037335e+01 1.75193660e+02 1.33970397e+01 -1.34350912e+01 9.27454091e+01
1716.lowfreq: -4.5482 -4.0835 0.0007 0.0009 0.0009 6.3068 23.5747 46.8251 48.9776
frequency: 23.5519 46.8061 48.9485 52.0574 71.9446 93.3445 113.6996 118.2554 133.2725 140.3167 171.9931 197.2048 224.8307 248.2190 272.8257 295.1439 306.7690 318.8846 357.9668 403.3390 434.0306 466.9527 478.9481 534.6412 549.1589 613.7429 633.6456 693.7820 723.8174 743.3083 746.9785 765.2253 815.0381 815.7063 839.1780 880.9886 915.8575 929.4854 958.0824 971.8582 975.0822 1026.0308 1028.9339 1061.8113 1072.1610 1088.0365 1115.1461 1121.9820 1134.5707 1137.5486 1158.8602 1191.3475 1218.8758 1234.2801 1242.0539 1265.2924 1271.3453 1276.5293 1286.6049 1327.0879 1355.2410 1364.4772 1368.0831 1391.5428 1402.2622 1410.2503 1432.7666 1461.0467 1464.0873 1470.7334 1473.2442 1476.7676 1482.3154 1492.0020 1494.3140 1593.7698 1609.9529 2864.2089 2884.0371 2970.9757 2980.5787 2986.9021 2999.4422 3025.7635 3033.5861 3067.6387 3096.7535 3108.3481 3168.0584 3173.0642 3188.0476 3435.0245 3564.7806
redmass: 5.7309 4.4666 3.7700 2.6771 5.0781 3.0231 3.7236 1.8556 5.4882 2.8995 3.7307 3.6687 4.9463 1.2233 5.3206 3.6783 1.4157 2.9080 4.0071 4.6917 3.9033 6.7755 3.7811 4.1838 4.6431 5.4455 7.7564 5.1085 1.7792 4.5474 2.8676 4.8573 1.2262 1.1721 1.2497 3.5790 3.1664 1.7303 4.1774 1.4385 1.6033 2.7133 2.6661 2.3036 1.8302 1.7807 2.2401 2.9240 1.4398 2.0504 1.3052 2.3857 5.8721 3.6920 1.4624 1.1396 1.2220 1.2752 1.2090 1.2839 5.9471 1.3195 1.3754 1.4310 1.4364 4.4105 3.5376 1.1887 1.0459 1.1767 1.2085 1.1068 1.2456 1.1509 1.3824 8.3764 6.9743 1.0705 1.0682 1.0556 1.0807 1.0721 1.0365 1.0878 1.1080 1.1029 1.0989 1.1017 1.0881 1.0922 1.0965 1.0737 1.0663
irintensity: 1.4911 0.7962 0.2444 2.4616 0.2935 6.6634 3.0554 0.7455 6.5852 4.3352 1.6724 5.6497 0.0290 1.4395 0.7977 1.1409 98.7529 51.5175 20.6524 1.2809 3.9888 3.8014 7.4253 4.6222 2.7137 10.3097 23.6652 33.9386 33.6607 15.5067 27.5255 12.7436 22.8953 23.0477 8.6392 16.2522 36.0516 17.3725 82.0844 7.2490 2.1159 28.7963 81.7045 11.0792 28.1114 43.8629 3.4069 80.6069 5.3454 69.4961 106.2576 110.0545 371.1637 241.3615 3.6416 0.0200 2.2908 16.9395 0.6238 14.5240 105.1346 8.6118 0.9188 9.6603 19.2060 30.8742 15.5183 86.6336 14.0634 12.2481 33.1455 2.1664 22.1280 3.2625 11.4843 25.9706 104.1814 66.1557 108.2488 34.5518 46.8914 44.7572 18.3165 22.8598 23.7884 44.5730 26.5306 30.8872 5.4515 2.2726 5.1723 5.2719 8.2815
temp: 298.150 k
press: 1.00000 atm
elementType: 8 8 8 8 7 7 6 6 6 6 6 6 6 6 6 6 6 1 1 1 1 1 1 1 1 1 1 1 1 1 1 1 1
symmnumber: 1
zpe: 691880.9 jmol-1
zpe.correction: 0.263524 hartree
zpe.thermalcorrener: 0.281502 hartree
zpe.thermalcorrenthalpy: 0.282446 hartree
zpe.thermalcorrgfe: 0.215447 hartree
zpe.sumelectzpe: -837.749516 hartree
zpe.sumelectthermal: -837.731538 hartree
zpe.sumelectthermalent: -837.730593 hartree
zpe.sumelectthermalfe: -837.797593 hartree
dipole: 3.6608 5.1256 0.8367
dipole: 6.3540
quadrupole: -143.5100 -83.0493 -101.2219
quadrupole: -12.0946 1.5054 -4.5354
quadrupole: -34.2496 26.2111 8.0385 -12.0946 1.5054 -4.5354
hfenergy: -838.0130397 hartree
pointgroup: C01 [X(C11H16N2O4)]
dipole: 1.4955937 2.0028767 0.0308426 debye
polarizability: 218.6745862|24.3611063|168.901968|6.9281895|-24.4715777|97.3306272 unknown
InChI: InChI=1S/C11H16N2O4/c1-2-17-11-4-3-10(13(15)16)7-9(11)8-12-5-6-14/h3-4,7,12,14H,2,5-6,8H2,1H3
charge 0 multiplicity 1
33 atoms
O  0.980545 1.83336 -0.050497
O  5.601995 -2.388072 -0.295344
O  -4.903143 -0.651196 -0.37909
O  -3.752116 -2.355571 0.611139
N  2.132249 -0.909163 0.004155
N  -3.81603 -1.170861 0.094287
C  -0.190099 -0.169013 0.514478
C  1.111565 -0.728292 1.066445
C  -0.236533 1.146858 -0.045832
C  -1.378913 -0.914644 0.549309
C  3.367429 -1.575723 0.469609
C  -2.581848 -0.367479 0.042561
C  -1.445553 1.689234 -0.553808
C  -2.627254 0.928631 -0.509854
C  4.318172 -1.809812 -0.720217
C  1.014463 3.225437 -0.564983
C  2.449394 3.718761 -0.410822
H  1.471874 -0.06166 1.889672
H  0.910826 -1.717894 1.517181
H  2.336813 -0.001702 -0.438844
H  -1.392264 -1.926846 0.962706
H  3.08454 -2.554208 0.911073
H  3.91933 -1.010052 1.260248
H  -1.474267 2.694186 -0.981999
H  -3.574222 1.316894 -0.893333
H  4.596149 -0.848803 -1.188022
H  3.813406 -2.43687 -1.482834
H  0.696203 3.225097 -1.626453
H  0.307176 3.842461 0.023983
H  2.52812 4.760265 -0.771181
H  2.761489 3.691859 0.646794
H  3.146197 3.096371 -0.997769
H  5.442208 -3.296451 0.065345
