program: Gaussian 09
title: 000148931
version: EM64L-G09RevD.01
frameworkgroup: C1[X(C13H10N2O2)]
method: RPBEPBE
basis: SDD
operation: Freq
keyword: #p
keyword: freq=noraman
keyword: PBEPBE/SDD
title: #p freq=noraman PBEPBE/SDD
converged: NO YES NO NO
title: Mulliken charges:
elementType: O O N N C C C C C C C C C C C C C H H H H H H H H H H
charge: -0.223675 -0.222904 -0.234023 0.014011 0.239590 0.229007 0.195373 0.238244 -0.546085 -0.325952 -0.382759 -0.363843 -0.644178 0.392222 -0.390025 -0.247634 -0.220506 0.293181 0.242949 0.243907 0.237329 0.240895 0.248453 0.241971 0.285757 0.230283 0.228412
chargesum: 0.00000
title: Mulliken charges with hydrogens summed into heavy atoms:
elementType: O O N N C C C C C C C C C C C C C
charge: -0.223675 -0.222904 -0.234023 0.014011 0.239590 0.229007 0.195373 0.238244 -0.252904 -0.083003 -0.138852 -0.126514 0.087141 0.392222 -0.104267 -0.017352 0.007907
polarizability: 3.00442791e+02 -9.16168828e+00 1.84249535e+02 4.97166188e-01 9.19403797e-01 6.51186781e+01
1716.lowfreq: -4.8360 0.0005 0.0006 0.0008 4.6455 6.6883 34.0040 62.5164 72.4202
frequency: 33.6924 62.4850 72.4170 119.5830 134.7104 136.1329 202.5659 248.8786 266.5068 300.5788 321.6807 352.7865 428.3366 452.1751 467.3584 494.7378 545.9265 560.0175 577.7099 591.8405 621.0577 624.8163 694.6782 714.1690 738.5943 741.7085 757.9055 777.8488 824.5310 837.6692 854.6558 859.4985 940.2828 943.8957 974.0699 980.5833 1003.3003 1019.9686 1048.9487 1083.0169 1116.1794 1121.4605 1129.4993 1145.5762 1171.9738 1211.7158 1232.6981 1249.0703 1288.0677 1322.7250 1351.9106 1358.0088 1404.7044 1415.0797 1434.0456 1453.3245 1465.8665 1469.8484 1477.9187 1488.5771 1503.9000 1582.9801 1591.8935 1609.2450 1640.0580 2983.1277 3073.5401 3104.8374 3132.2667 3140.8673 3152.9860 3153.8830 3169.0392 3176.8450 3187.1587
redmass: 1.0606 12.3692 5.7030 3.6566 7.0726 3.7544 5.0448 3.7369 4.4250 4.6933 6.6402 6.3106 3.0817 2.9754 6.7512 7.9971 5.2432 4.2103 4.1308 4.7329 7.4764 6.0124 5.4721 5.8297 8.8735 2.4575 1.9724 2.7687 1.5732 4.7265 4.8890 1.4702 1.4053 1.4697 1.3292 1.3186 3.5740 2.0166 4.9011 2.7910 1.3181 1.6720 1.4592 1.4736 1.1011 8.0150 2.3008 1.7650 1.9504 2.1424 5.2169 3.9179 4.6385 3.5009 1.7619 2.8306 2.1130 2.3896 1.0924 1.5819 3.3855 7.7702 6.9291 7.6473 7.8321 1.0377 1.0971 1.1009 1.0853 1.0894 1.0952 1.0902 1.1003 1.0927 1.0950
irintensity: 0.1854 0.0209 0.0120 0.0302 1.0581 5.6845 3.3219 0.7144 0.5712 0.1426 0.1755 0.1444 7.2092 0.0022 0.7314 1.6073 6.9013 3.4613 0.0421 2.7143 12.3411 2.4481 31.8785 5.5585 11.3223 17.8611 61.9674 9.7150 46.1725 6.9569 8.3538 0.2855 19.6848 3.4352 2.0771 0.0684 0.2400 16.2442 0.9015 31.4733 13.3346 52.1825 4.7716 61.7759 3.8462 590.5042 14.0953 88.2223 4.7211 43.8426 91.6589 70.9505 7.6582 21.4645 23.8833 14.7606 25.1046 7.2710 32.3197 27.2260 46.6846 4.4524 0.4017 119.0339 32.4960 63.8297 20.0276 7.7039 0.4687 3.2587 20.1973 12.5375 27.1946 1.6467 4.4660
temp: 298.150 k
press: 1.00000 atm
elementType: 8 8 7 7 6 6 6 6 6 6 6 6 6 6 6 6 6 1 1 1 1 1 1 1 1 1 1
symmnumber: 1
zpe: 531872.9 jmol-1
zpe.correction: 0.202580 hartree
zpe.thermalcorrener: 0.216044 hartree
zpe.thermalcorrenthalpy: 0.216989 hartree
zpe.thermalcorrgfe: 0.161452 hartree
zpe.sumelectzpe: -760.107464 hartree
zpe.sumelectthermal: -760.093999 hartree
zpe.sumelectthermalent: -760.093055 hartree
zpe.sumelectthermalfe: -760.148592 hartree
dipole: 7.4683 4.0091 0.0222
dipole: 8.4764
quadrupole: -115.7878 -82.9482 -101.8679
quadrupole: -3.9683 0.0352 -0.0303
quadrupole: -15.5865 17.2531 -1.6666 -3.9683 0.0352 -0.0303
hfenergy: -760.3100437 hartree
pointgroup: C01 [X(C13H10N2O2)]
dipole: -2.8912774 1.6618767 -0.0099521 debye
polarizability: 300.8762095|5.777691|183.8149395|0.4897441|-0.9994645|65.1198548 unknown
InChI: InChI=1S/C13H10N2O2/c1-14-12-5-3-2-4-10(12)11-8-9(15(16)17)6-7-13(11)14/h2-8H,1H3
charge 0 multiplicity 1
27 atoms
O  4.826736 0.005096 -0.004076
O  3.814011 -2.041447 0.006691
N  -1.359501 1.581115 0.013333
N  3.77113 -0.746439 0.001475
C  0.044715 -0.25676 0.004732
C  -0.018268 1.186901 0.002921
C  -1.331809 -0.738685 0.004754
C  -2.175201 0.424853 0.002717
C  1.292952 -0.9014 0.005282
C  1.152557 1.981758 -0.007461
C  -1.91683 -2.024608 0.004878
C  -3.581604 0.325722 -0.007897
C  -1.845576 2.961591 0.003558
C  2.451116 -0.092621 0.001362
C  2.395841 1.329238 -0.006206
C  -3.323904 -2.133001 0.00032
C  -4.14358 -0.970299 -0.007211
H  1.396998 -1.989634 0.008127
H  1.107523 3.074718 -0.024127
H  -1.291347 -2.923881 0.007611
H  -4.22567 1.210877 -0.024296
H  -1.127375 3.61527 0.525398
H  -1.988536 3.339002 -1.026609
H  -2.807245 3.020854 0.539492
H  3.334108 1.889486 -0.014271
H  -3.793785 -3.122006 -0.000539
H  -5.233455 -1.081299 -0.015957
