program: Gaussian 09
title: 000148927
version: EM64L-G09RevD.01
frameworkgroup: C1[X(C18H14)]
method: RPBEPBE
basis: SDD
operation: Freq
keyword: #p
keyword: freq=noraman
keyword: PBEPBE/SDD
title: #p freq=noraman PBEPBE/SDD
converged: YES YES NO NO
title: Mulliken charges:
elementType: C C C C C C C C C C C C C C C C C C H H H H H H H H H H H H H H
charge: 0.378412 -0.583454 0.369359 0.231188 0.454666 -0.460719 -0.708026 -0.616880 0.195896 -0.389426 0.422558 -0.204479 -0.498313 -0.480766 -0.370866 -0.434476 -0.260805 -0.250774 0.228370 0.225590 0.226415 0.214743 0.243121 0.227228 0.231787 0.220247 0.239328 0.233892 0.223527 0.238523 0.226212 0.227922
chargesum: 0.00000
title: Mulliken charges with hydrogens summed into heavy atoms:
elementType: C C C C C C C C C C C C C C C C C C
charge: 0.378412 -0.129494 0.369359 0.231188 0.454666 -0.019561 -0.464905 -0.389653 0.195896 -0.157639 0.422558 0.015768 -0.258984 -0.246874 -0.147339 -0.195953 -0.034593 -0.022852
polarizability: 3.64785101e+02 5.46449606e-01 2.02832441e+02 2.85017562e-01 1.92374174e+00 8.32056351e+01
1716.lowfreq: -0.0005 0.0002 0.0004 6.8137 7.7280 16.4935 64.4959 71.1167 131.1192
frequency: 64.4863 71.1128 131.1187 157.5635 168.7316 210.4667 256.1944 297.3028 325.5604 348.7865 388.2875 427.6134 437.3150 443.5482 482.4025 513.3998 530.5102 535.0045 564.0149 585.1235 635.9803 654.5593 707.7299 717.6411 724.4500 754.1542 758.3018 764.7615 791.3452 806.2241 831.2305 870.3698 884.7127 890.3788 903.0443 911.5955 917.1045 956.7280 963.9593 972.3813 980.6361 990.5139 1024.4690 1032.9392 1040.3289 1099.7808 1146.5967 1155.3928 1163.1946 1172.0268 1176.9322 1206.7776 1221.9352 1231.7691 1240.1909 1268.0481 1284.8504 1302.5777 1314.6340 1331.1224 1368.5668 1392.3986 1405.6196 1408.4862 1432.2880 1446.0022 1451.8223 1458.7320 1471.7323 1507.9284 1515.1881 1569.6360 1609.9030 1623.9941 1629.4239 1640.6413 2948.9934 2957.6139 3031.4654 3039.7993 3106.1168 3110.7748 3116.8675 3120.3657 3129.9399 3134.9969 3138.2302 3142.0426 3150.3229 3164.8629
redmass: 4.1760 3.5785 3.4008 4.8206 3.3506 2.8667 3.4149 4.8840 3.0898 4.9494 3.0155 2.8911 2.8372 4.3399 5.4172 4.4744 4.6963 3.6417 3.0371 4.9218 5.8326 2.5615 2.2255 4.1571 2.4596 2.9868 1.5061 4.3231 1.9450 2.1925 1.4622 4.0499 1.6874 2.6691 2.3177 2.0913 1.7323 1.3929 2.9441 1.4191 1.3883 1.3686 2.0518 2.4852 2.1127 2.2079 1.6598 1.2121 1.1481 1.5094 1.0886 1.4580 1.6205 1.8645 1.6607 1.9569 1.5934 1.7571 1.6874 1.6303 2.2678 3.2683 2.9740 2.8576 2.9905 3.5071 1.1404 1.1047 3.2256 3.6990 3.9842 7.2600 6.0830 6.5373 7.0999 6.7302 1.0695 1.0634 1.0917 1.0959 1.0856 1.0910 1.0863 1.0862 1.0893 1.0904 1.0985 1.0980 1.0931 1.0995
irintensity: 1.2349 0.0101 0.2173 0.3844 1.4720 0.8365 1.5795 0.2694 2.3237 1.9316 0.9044 8.1301 6.4744 2.7794 0.3677 1.3243 0.6113 0.7229 11.1934 3.3915 8.0678 16.7611 6.8356 3.6459 0.9852 1.9776 51.5790 5.6849 18.3117 2.6905 45.1304 1.0397 0.0807 9.7491 18.2205 43.9802 3.4535 6.3453 3.5249 3.0745 0.0266 0.0479 9.2277 8.4537 5.8878 6.2177 0.1868 1.0434 0.7724 1.2031 0.7477 9.2926 5.0709 2.0757 13.5912 3.2136 2.2036 2.2905 4.9695 1.9315 0.9331 2.6120 0.0552 1.0520 4.0042 10.6070 8.8673 10.4843 13.5192 15.8886 3.1312 0.2704 2.4794 0.3663 1.4853 0.0754 39.1900 34.8977 57.4842 28.1162 2.7508 15.0879 4.5360 3.0991 7.6678 3.8744 45.2506 30.9653 40.8167 36.6482
temp: 298.150 k
press: 1.00000 atm
elementType: 6 6 6 6 6 6 6 6 6 6 6 6 6 6 6 6 6 6 1 1 1 1 1 1 1 1 1 1 1 1 1 1
symmnumber: 1
zpe: 681660.1 jmol-1
zpe.correction: 0.259631 hartree
zpe.thermalcorrener: 0.272576 hartree
zpe.thermalcorrenthalpy: 0.273520 hartree
zpe.thermalcorrgfe: 0.220488 hartree
zpe.sumelectzpe: -693.126760 hartree
zpe.sumelectthermal: -693.113815 hartree
zpe.sumelectthermalent: -693.112871 hartree
zpe.sumelectthermalfe: -693.165903 hartree
dipole: 1.0498 0.1683 0.0832
dipole: 1.0664
quadrupole: -86.9720 -91.8369 -112.2307
quadrupole: 0.9701 0.2781 0.4846
quadrupole: 10.0412 5.1763 -15.2175 0.9701 0.2781 0.4846
hfenergy: -693.3863911 hartree
pointgroup: C01 [X(C18H14)]
dipole: -0.4127621 0.0674794 -0.0333927 debye
polarizability: 364.7784178|-1.1722298|202.7909315|0.2899518|-3.0769945|83.253828 unknown
InChI: InChI=1S/C18H14/c1-2-7-15-12-18-16(11-14(15)6-1)10-9-13-5-3-4-8-17(13)18/h2-5,7-12H,1,6H2
charge 0 multiplicity 1
32 atoms
C  -2.42631 0.679483 0.114426
C  -3.906021 1.008963 0.262969
C  -2.031185 -0.706928 0.124793
C  0.360068 -0.05266 0.041797
C  -0.043997 1.331966 0.007823
C  -4.821081 -0.026614 -0.435868
C  -1.436671 1.661207 0.048409
C  -0.664812 -1.042697 0.098906
C  1.788582 -0.380628 0.011898
C  -3.076098 -1.744127 0.138019
C  2.755463 0.689926 -0.052967
C  -4.383569 -1.448346 -0.124144
C  0.956915 2.370778 -0.05813
C  2.304562 2.062862 -0.087402
C  2.27787 -1.723262 0.044475
C  4.151918 0.383637 -0.082797
C  3.651281 -2.002241 0.014804
C  4.600433 -0.94152 -0.049645
H  -4.151442 1.008804 1.346514
H  -4.117373 2.027834 -0.110208
H  -4.796002 0.123147 -1.537214
H  -5.87109 0.131526 -0.126109
H  -1.722729 2.721068 0.038307
H  -0.398204 -2.105318 0.11138
H  -2.76717 -2.781687 0.319098
H  -5.134993 -2.246911 -0.161428
H  0.62378 3.415182 -0.083573
H  3.058001 2.857901 -0.136862
H  1.574227 -2.559917 0.09435
H  4.871068 1.210195 -0.132307
H  3.997359 -3.041426 0.041321
H  5.672418 -1.165698 -0.072836
