program: Gaussian 09
title: 000148956
version: EM64L-G09RevD.01
frameworkgroup: C1[X(C20H16O)]
method: RPBEPBE
basis: SDD
operation: Freq
keyword: #pfreq=noraman
keyword: PBEPBE/SDD
title: #p freq=noraman PBEPBE/SDD
converged: YES YES NO NO
title: Mulliken charges:
elementType: O C C C C C C C C C C C C C C C C C C C C H H H H H H H H H H H H H H H H
charge: -0.284485 0.229407 0.235888 0.158883 0.187874 0.134499 0.283140 -0.194090 0.428770 -0.425399 -0.532007 -0.364003 -0.901910 -0.342915 -0.411332 -0.451235 -0.264585 -0.249537 -0.271575 -0.256738 -0.521077 0.227012 0.237410 0.223920 0.284120 0.260149 0.213333 0.250731 0.274261 0.242151 0.226631 0.230779 0.226452 0.229925 0.234486 0.225776 0.225290
chargesum: 0.00000
title: Mulliken charges with hydrogens summed into heavy atoms:
elementType: O C C C C C C C C C C C C C C C C C C C C
charge: -0.284485 0.229407 0.235888 0.158883 0.187874 0.134499 0.283140 -0.194090 0.428770 -0.198387 -0.294597 -0.140083 -0.144308 -0.092184 -0.137071 -0.209084 -0.037954 -0.018759 -0.045123 -0.026813 0.164476
polarizability: 3.86515959e+02 -1.89174021e+01 2.50733081e+02 1.16685578e+00 1.74781834e+00 9.51100800e+01
1716.lowfreq: -7.3115 -4.0603 -0.0004 0.0007 0.0010 3.7923 46.4830 56.8401 75.2981
frequency: 46.4669 56.8282 75.2839 108.8036 123.6633 152.1974 156.6905 193.3745 211.5698 241.1833 268.3891 302.6761 318.8713 348.4470 362.1572 365.1568 396.1322 420.4062 435.0270 453.9699 465.1670 494.6207 530.1018 543.8620 562.4466 585.3399 605.1343 624.3265 654.3747 670.7769 698.6959 719.2713 748.1639 754.7144 775.2653 785.5679 810.4572 840.1619 846.5313 879.1199 882.9050 898.5974 921.7187 955.3268 964.6564 974.8357 977.3632 989.3657 995.5965 1011.5221 1034.7279 1040.4014 1047.1938 1064.4503 1082.5681 1112.6051 1121.7418 1147.3746 1155.3964 1169.0885 1175.1389 1180.4161 1236.4737 1248.3784 1262.2509 1272.9772 1301.9266 1331.9839 1369.9085 1380.1545 1397.4160 1403.5299 1409.2627 1424.3002 1429.1490 1441.6159 1445.4304 1460.2176 1468.6183 1477.3970 1480.8928 1501.7342 1521.8309 1525.1527 1571.6044 1580.5055 1611.9744 1620.1228 1624.8899 2961.9993 2971.6793 3049.8966 3057.3167 3097.9675 3112.2081 3120.9389 3127.7082 3129.6062 3134.4684 3145.9440 3158.4719 3160.5907 3171.3345 3175.2545 3220.5416
redmass: 4.3543 3.5335 3.5634 3.4890 2.9775 1.1854 3.0776 4.0895 4.0996 4.1266 5.4787 4.4323 5.0025 1.4091 2.3790 5.0746 3.3841 4.3853 3.7506 3.1112 5.1038 3.6245 6.5051 5.7871 3.3249 3.7581 4.9926 6.2081 5.7648 3.1484 4.0223 5.6091 4.3685 1.3567 1.5071 2.5255 1.8694 5.0139 1.7450 4.3193 1.6957 2.3677 6.8333 1.3766 1.3949 2.1473 2.4886 1.3554 1.3291 2.8627 2.1230 1.6930 2.0086 2.2580 3.7997 1.2685 2.1656 1.4659 1.5516 1.2566 1.1473 1.1536 2.0290 1.7316 1.6185 2.9406 1.9817 3.2168 5.7181 3.6916 1.2312 5.1565 2.8736 2.6380 2.6508 1.4246 2.2961 1.0617 1.2107 1.8767 1.1912 1.1417 4.2337 3.0725 7.6798 6.9310 6.1841 6.2648 6.7213 1.0310 1.0425 1.1038 1.0899 1.1000 1.1013 1.0867 1.0871 1.0870 1.0906 1.0903 1.0990 1.0962 1.0946 1.0953 1.0908
irintensity: 0.1935 0.7720 3.3327 0.7560 0.8329 0.6074 1.4005 2.2311 3.5201 2.6919 1.9206 2.2512 1.9203 0.9533 2.8418 0.6186 2.8161 2.6883 2.4059 8.6030 4.7073 2.6046 1.4488 2.6192 0.3121 8.2279 0.2652 14.0242 1.2888 6.0578 8.7032 2.1390 4.1644 6.1382 139.5919 2.0646 30.4851 0.0400 16.2455 6.3466 12.0462 4.4014 10.9616 1.3184 3.9880 13.4118 18.9091 0.3579 0.5285 7.3315 5.9916 8.0777 6.0969 4.7677 96.3935 0.7318 0.8334 7.4071 35.7070 0.0296 1.9160 0.8761 13.6288 22.8405 0.6443 12.1289 0.2884 43.0975 1.7052 8.9682 8.8636 0.9349 7.9367 8.7894 0.2435 12.0151 5.5582 14.2600 14.8535 12.1847 14.2275 17.7281 9.6682 4.5418 0.5653 26.2734 0.5092 0.8557 0.1034 65.4828 38.4132 36.6172 14.3942 9.4079 30.5845 1.4512 1.3576 8.0147 21.2500 17.8498 42.3897 7.1182 27.1871 34.8417 11.1377
temp: 298.150 k
press: 1.00000 atm
elementType: 8 6 6 6 6 6 6 6 6 6 6 6 6 6 6 6 6 6 6 6 6 1 1 1 1 1 1 1 1 1 1 1 1 1 1 1 1
symmnumber: 1
zpe: 778350.3 jmol-1
zpe.correction: 0.296458 hartree
zpe.thermalcorrener: 0.313052 hartree
zpe.thermalcorrenthalpy: 0.313997 hartree
zpe.thermalcorrgfe: 0.252864 hartree
zpe.sumelectzpe: -845.531412 hartree
zpe.sumelectthermal: -845.514817 hartree
zpe.sumelectthermalent: -845.513873 hartree
zpe.sumelectthermalfe: -845.575005 hartree
dipole: -0.2494 0.6640 1.4836
dipole: 1.6444
quadrupole: -108.3537 -103.1145 -129.8414
quadrupole: 0.3900 3.7966 4.7676
quadrupole: 5.4161 10.6554 -16.0715 0.3900 3.7966 4.7676
hfenergy: -845.8278696 hartree
pointgroup: C01 [X(C20H16O1)]
dipole: -0.1061008 0.2412692 0.5908427 debye
polarizability: 387.3242096|-15.7474093|249.6726361|1.5662359|6.3584921|95.3622739 unknown
InChI: InChI=1S/C20H16O/c1-13-19-15-8-4-3-7-14(15)11-12-17(19)16-9-5-6-10-18(16)20(13)21-2/h3-12H,1-2H3
charge 0 multiplicity 1
37 atoms
O  2.36964 2.542684 -0.306285
C  -0.578041 0.190661 -0.074114
C  0.128938 -1.066443 -0.061031
C  0.192092 1.426195 -0.223362
C  1.587989 -1.105881 -0.011197
C  -2.046764 0.162709 0.035882
C  2.323317 0.129889 -0.02123
C  1.58857 1.362635 -0.148496
C  -2.745826 -1.101474 -0.075058
C  -0.614539 -2.299503 -0.135605
C  -1.993879 -2.319789 -0.192913
C  2.339867 -2.322657 0.073972
C  -0.405781 2.771817 -0.612695
C  -2.857158 1.311532 0.325375
C  3.752374 0.123777 0.039243
C  -4.173867 -1.152928 -0.012446
C  3.737889 -2.314184 0.144597
C  4.454127 -1.081563 0.123493
C  -4.253967 1.237215 0.410882
C  -4.929715 0.000234 0.212209
C  2.456262 3.385296 0.901007
H  -0.074545 -3.248217 -0.178525
H  -2.535198 -3.268089 -0.28872
H  1.826929 -3.287735 0.097455
H  0.364513 3.356584 -1.142646
H  -1.272997 2.645746 -1.28088
H  -0.734292 3.380123 0.25262
H  -2.387643 2.271098 0.532927
H  4.27624 1.082374 -0.007598
H  -4.66557 -2.127054 -0.121393
H  4.284471 -3.261074 0.215408
H  5.548643 -1.083275 0.16731
H  -4.828086 2.140765 0.64456
H  -6.022704 -0.047986 0.263963
H  3.111119 4.227947 0.629884
H  2.898117 2.817542 1.742684
H  1.461473 3.767029 1.200522
