program: Gaussian 09
title: 000148922
version: EM64L-G09RevD.01
frameworkgroup: C1[X(C18H16O2)]
method: RPBEPBE
basis: SDD
operation: Freq
keyword: #pfreq=noraman
keyword: PBEPBE/SDD
title: #p freq=noraman PBEPBE/SDD
converged: YES YES NO NO
title: Mulliken charges:
elementType: O O C C C C C C C C C C C C C C C C C C H H H H H H H H H H H H H H H H
charge: -0.457220 -0.442798 -0.125220 -0.312249 0.093013 -0.508493 -0.478006 0.377722 0.213965 0.483239 -0.386819 -0.506392 -0.643379 -0.704171 0.415451 0.400495 -0.436746 -0.423552 -0.246753 -0.244210 0.203493 0.243193 0.215316 0.237689 0.228140 0.221293 0.242294 0.239833 0.244784 0.245495 0.339850 0.336062 0.240327 0.240572 0.226727 0.227055
chargesum: 0.00000
title: Mulliken charges with hydrogens summed into heavy atoms:
elementType: O O C C C C C C C C C C C C C C C C C C
charge: -0.117371 -0.106736 0.078273 -0.069056 0.093013 -0.055487 -0.028573 0.377722 0.213965 0.483239 -0.144525 -0.266559 -0.398595 -0.458676 0.415451 0.400495 -0.196418 -0.182981 -0.020025 -0.017155
polarizability: 3.56231011e+02 2.43825131e+01 2.07143311e+02 -2.18018356e+00 7.03695893e+00 9.98624723e+01
1716.lowfreq: -9.2240 -3.9279 -0.0005 -0.0005 0.0004 5.2034 45.3466 47.7296 87.0412
frequency: 45.2742 47.7071 87.0407 114.7965 143.4897 177.2694 201.4757 223.8018 246.6658 259.0157 268.9984 287.0666 298.3216 335.5587 347.1191 395.0086 400.5407 442.9928 464.9376 472.0224 492.2956 522.6651 532.2003 552.5352 558.5891 611.7698 619.8128 661.3403 696.4705 708.4283 752.5682 756.0833 776.1111 784.5217 804.9178 819.3063 850.5598 856.4406 883.8684 898.0881 902.3472 924.4236 928.7558 948.8793 957.9392 964.9740 974.2481 988.5508 998.1594 1014.4839 1049.7263 1078.7499 1102.5861 1133.3413 1153.9643 1164.2869 1169.8891 1180.8103 1190.0642 1199.4938 1204.3791 1227.8027 1230.6512 1274.1629 1284.6101 1288.4882 1295.3785 1314.3380 1330.5733 1359.6768 1373.3501 1382.8551 1396.3148 1404.1275 1421.2011 1434.1091 1439.2206 1449.6494 1458.9824 1466.9268 1484.5580 1556.1546 1571.1015 1590.6500 1632.2217 1636.6438 2944.1318 2968.0022 2968.8334 2987.4957 3027.1791 3044.9282 3115.0915 3117.1205 3122.0635 3122.8051 3136.9716 3141.1672 3147.9888 3160.6571 3541.6584 3566.1225
redmass: 4.8524 5.2231 4.1547 5.1690 4.8166 4.1962 4.0584 3.2270 3.3173 1.3487 3.1426 1.1265 3.7982 3.3554 3.8919 3.4674 4.1012 4.7021 3.8857 2.4828 4.8090 3.8260 3.9258 4.4481 5.1381 4.3445 6.1073 3.5850 3.3916 5.1912 1.5110 2.4524 3.5805 2.9995 2.4844 1.5795 3.9765 1.4808 2.2644 2.0297 2.6432 4.2021 2.0767 3.2461 3.2919 1.3880 1.4516 1.3487 3.0046 2.2901 2.3709 2.1209 1.7760 1.6666 1.3542 1.1263 1.0939 1.2750 1.3473 1.2747 1.7637 1.5326 1.3210 1.8786 1.6952 1.2968 2.2262 1.5810 1.8046 1.6544 1.7957 1.9060 1.6710 4.2338 2.2332 3.7598 6.3211 1.2755 1.0987 2.6530 3.0556 5.6047 8.1548 5.5884 7.0111 6.6339 1.0828 1.0646 1.0822 1.0646 1.0957 1.1011 1.0909 1.0863 1.0873 1.0877 1.0899 1.0949 1.0979 1.1003 1.0662 1.0662
irintensity: 0.2802 0.7260 0.3984 0.4485 0.2467 9.1631 4.8432 13.9489 40.9246 115.1594 12.6714 101.2732 22.7182 0.9580 6.5686 2.3032 4.0558 2.8672 2.9469 19.5096 3.2978 2.7897 0.6275 3.1261 3.0960 1.6123 5.2133 16.4420 1.5482 2.2085 63.5533 14.2368 0.6726 4.6310 2.9685 16.3164 3.1966 0.8038 20.0158 52.2600 31.4166 39.4811 13.9208 25.6550 37.4776 4.4806 7.7789 0.1612 15.4604 5.3941 25.3117 24.3536 3.9493 5.4406 19.2367 23.1038 1.2857 11.2295 11.9796 8.9378 3.2207 3.3496 17.7103 1.2306 3.8162 1.6248 8.2937 16.5402 15.2431 3.7303 1.7196 11.4704 4.8123 10.6700 4.9113 2.7722 0.7714 6.2978 14.5219 5.7118 2.0094 4.8289 1.1281 0.1053 4.1784 0.9466 79.3536 13.7120 42.0432 72.8730 18.7594 30.2744 6.2549 6.3937 1.0167 4.7864 4.3259 37.9038 30.5832 47.3738 5.8692 3.6586
temp: 298.150 k
press: 1.00000 atm
elementType: 8 8 6 6 6 6 6 6 6 6 6 6 6 6 6 6 6 6 6 6 1 1 1 1 1 1 1 1 1 1 1 1 1 1 1 1
symmnumber: 1
zpe: 759890.0 jmol-1
zpe.correction: 0.289427 hartree
zpe.thermalcorrener: 0.305433 hartree
zpe.thermalcorrenthalpy: 0.306377 hartree
zpe.thermalcorrgfe: 0.246566 hartree
zpe.sumelectzpe: -844.574035 hartree
zpe.sumelectthermal: -844.558029 hartree
zpe.sumelectthermalent: -844.557085 hartree
zpe.sumelectthermalfe: -844.616897 hartree
dipole: 1.7006 -1.8502 0.0716
dipole: 2.5141
quadrupole: -91.7171 -99.2386 -127.7875
quadrupole: -5.7176 -0.7538 2.4309
quadrupole: 14.5306 7.0092 -21.5398 -5.7176 -0.7538 2.4309
hfenergy: -844.8634622 hartree
pointgroup: C01 [X(C18H16O2)]
dipole: -0.660291 0.7351488 0.0436109 debye
polarizability: 356.7926261|22.5353413|206.8332799|2.7340329|-4.7439356|99.6108885 unknown
InChI: InChI=1S/C18H16O2/c19-17-8-7-14-15(18(17)20)6-5-13-9-11-3-1-2-4-12(11)10-16(13)14/h1-6,9-10,17-20H,7-8H2
charge 0 multiplicity 1
36 atoms
O  -4.078196 1.316234 1.618334
O  -4.282356 -1.040039 -1.217951
C  -4.158337 1.003323 0.175708
C  -3.742742 -0.474476 0.048193
C  -1.312986 0.333518 -0.083685
C  -3.24338 1.899056 -0.669305
C  -1.772839 1.778273 -0.222864
C  -2.242201 -0.706517 0.023965
C  0.110085 0.029346 -0.037455
C  0.54366 -1.361451 0.073004
C  -1.799894 -2.073829 0.134752
C  -0.454157 -2.397616 0.149748
C  1.106057 1.037385 -0.088205
C  1.925351 -1.666517 0.10952
C  2.491354 0.734807 -0.047186
C  2.915908 -0.656231 0.049721
C  3.499621 1.763116 -0.099927
C  4.325518 -0.953094 0.085141
C  4.853143 1.440525 -0.063136
C  5.270966 0.066674 0.029935
H  -5.211957 1.104006 -0.165888
H  -4.178024 -1.015309 0.915415
H  -3.574091 2.955347 -0.614637
H  -3.345341 1.574457 -1.72332
H  -1.633462 2.293225 0.750035
H  -1.137227 2.31114 -0.954272
H  -2.560982 -2.859975 0.192404
H  -0.128955 -3.441456 0.228375
H  0.814236 2.091185 -0.154184
H  2.234802 -2.716536 0.189185
H  -4.251871 2.282778 1.746398
H  -5.253754 -1.203323 -1.100153
H  3.180924 2.810191 -0.171479
H  4.641896 -2.000727 0.157324
H  5.610559 2.231037 -0.104987
H  6.340574 -0.169026 0.057478
