program: Gaussian 09
title: 000148955
version: EM64L-G09RevD.01
frameworkgroup: C1[X(C22H32N2O)]
method: RPBEPBE
basis: SDD
operation: Freq
keyword: #p
keyword: freq=noraman
keyword: PBEPBE/SDD
title: #p freq=noraman PBEPBE/SDD
converged: YES YES NO NO
title: Mulliken charges:
elementType: O N N C C C C C C C C C C C C C C C C C C C C C C H H H H H H H H H H H H H H H H H H H H H H H H H H H H H H H H
charge: -0.212739 0.037960 -0.371557 0.182873 -0.439436 -0.449061 0.272012 -0.494383 0.187363 -0.742598 -0.734058 -0.352179 -0.836923 -0.334473 0.396890 -0.835492 -0.354672 -0.235629 -0.321351 0.420285 -0.829458 -0.344934 -0.281400 0.256445 -0.770173 0.199909 0.199622 0.206980 0.207620 0.213508 0.210885 0.227418 0.210721 0.212800 0.223661 0.213135 0.209057 0.216222 0.223193 0.262672 0.216338 0.240344 0.226310 0.230760 0.235103 0.215615 0.227554 0.223604 0.236020 0.217790 0.235724 0.251382 0.193425 0.275692 0.258937 0.258956 0.205731
chargesum: 0.00000
title: Mulliken charges with hydrogens summed into heavy atoms:
elementType: O N N C C C C C C C C C C C C C C C C C C C C C C
charge: -0.212739 0.037960 -0.095865 0.182873 -0.039905 -0.034462 0.272012 -0.069990 0.187363 -0.091659 -0.088206 -0.135957 -0.134720 -0.094129 0.396890 -0.143317 -0.139057 -0.008075 -0.097747 0.420285 -0.139924 -0.093552 -0.087975 0.256445 -0.046549
polarizability: 1.02840512e+03 2.58425167e+01 2.61084632e+02 2.50195329e+01 5.53418081e+00 1.63958306e+02
1716.lowfreq: -7.8384 -0.0011 0.0006 0.0014 0.9938 3.9414 16.2261 21.6016 28.7553
frequency: 15.6712 21.5732 28.3923 35.2836 50.0113 54.8917 63.4967 68.5251 81.2000 91.5850 99.4881 112.5066 129.2247 138.3045 140.7238 154.0885 173.1556 181.7303 202.5930 214.0566 222.9868 226.0048 237.6904 247.1860 261.4605 264.7623 301.0070 309.2349 326.6919 330.1728 345.2178 353.5543 375.3667 388.5491 402.0105 409.5999 422.5905 432.6791 465.2889 484.5232 496.1820 521.7194 534.9802 538.2232 567.6604 583.7293 586.6330 609.0918 631.6799 632.3812 660.8568 726.7805 787.2597 830.8168 841.3985 850.6418 862.5317 869.4691 883.6146 897.7517 903.3112 911.4571 922.8434 931.9660 937.0537 939.3237 962.3746 966.0748 975.9287 976.9265 991.5250 1001.7823 1007.1668 1022.9608 1032.6692 1034.8697 1035.6479 1037.6646 1047.2041 1074.1804 1084.0596 1124.4366 1138.3345 1168.3752 1177.6395 1196.0811 1202.1769 1204.4773 1213.2405 1215.4035 1222.9703 1246.5576 1264.0231 1271.7944 1282.5886 1300.8819 1312.0285 1315.2029 1330.9724 1337.5385 1342.6316 1357.7054 1374.6887 1375.6431 1383.9413 1388.2267 1392.6108 1394.8180 1399.4794 1402.5123 1449.6173 1450.1316 1457.6056 1464.4040 1467.5673 1470.1535 1470.3348 1471.3747 1472.3448 1472.9793 1473.7049 1474.8293 1475.8428 1479.6904 1488.8869 1492.8718 1513.4341 1562.6071 1576.1276 1604.7693 1621.8306 1627.7712 1644.9800 2934.3740 2956.0922 2963.8154 2970.9383 2973.4263 2975.3821 2976.6236 2980.6997 2984.9054 2994.0929 3000.9221 3022.1114 3027.5400 3044.5476 3046.9804 3053.3152 3062.2719 3067.4811 3074.8546 3076.7576 3078.7175 3084.0906 3085.9851 3086.5591 3094.7148 3098.8011 3101.9371 3104.6999 3111.1696 3121.1161 3123.1000 3364.1102
redmass: 4.1640 5.0592 4.0943 3.5044 3.8431 3.3209 1.3837 3.1678 2.3688 3.5120 2.7761 2.6507 1.6702 1.5148 1.9118 1.2901 2.3093 2.9263 1.5521 1.9600 2.5103 3.2434 1.9638 1.1776 2.1866 2.2841 2.6903 2.4962 2.5783 3.2477 2.4005 2.8400 2.1487 4.7687 2.4995 3.3206 2.9213 3.5664 3.5204 3.3492 2.6784 3.2105 2.4745 3.5989 2.4905 3.4859 3.7125 3.3799 3.9660 1.2005 3.9772 3.0256 2.6097 3.0993 1.5363 1.6260 2.2665 2.4252 2.2377 2.0262 1.6868 1.6365 1.5696 1.2599 1.9266 3.5368 1.1519 2.1738 1.4361 1.2298 1.4057 1.4657 1.5325 1.6960 1.8511 1.5166 1.6104 1.4932 1.5736 5.0939 1.6329 1.6335 3.0540 2.1327 2.7252 2.3706 2.0401 2.4736 1.8948 1.5514 2.1228 1.7161 1.6210 1.3281 1.5876 1.5255 1.5681 1.4867 1.7569 1.6286 1.8277 1.8456 1.1918 1.8395 1.3682 1.2159 1.2009 1.2097 1.3690 1.5384 1.0449 1.0893 1.0677 1.0540 1.0966 1.0540 1.0866 1.0559 1.1484 1.0721 1.0793 1.1134 1.0769 1.0696 1.0656 1.8160 3.8018 3.7247 5.1300 5.2561 5.5306 5.0165 7.1421 1.0657 1.0409 1.0589 1.0357 1.0827 1.0371 1.0397 1.0423 1.0691 1.0362 1.0856 1.0985 1.0935 1.1027 1.0969 1.0973 1.0992 1.0983 1.0888 1.0996 1.0958 1.0961 1.0902 1.0904 1.1001 1.0982 1.0957 1.0949 1.0889 1.0895 1.0872 1.0752
irintensity: 0.0031 1.9082 8.2388 5.3886 1.5384 2.0483 0.5618 1.4571 0.9409 1.1887 2.2935 1.4838 0.1742 1.0806 1.5687 1.5199 0.7136 1.3059 0.7612 2.8818 5.7610 1.8720 3.6232 0.5196 2.1434 2.8108 0.4153 0.4518 3.7146 4.7241 2.9737 0.4421 1.2828 1.7674 5.2203 5.5786 2.8914 0.8413 0.8500 0.4984 3.4107 3.9012 2.3676 7.3234 5.2914 4.4733 15.5140 7.9420 0.7143 69.0487 17.1705 16.4754 6.5841 8.4288 2.3792 9.0666 2.0415 0.7437 8.2773 8.1676 7.2508 1.6746 0.7334 26.5341 0.8995 6.7169 7.1349 50.1320 25.2911 105.5450 20.7936 4.9047 3.6039 5.9008 8.1124 0.5647 14.0453 0.0443 7.0543 312.8323 5.2258 11.7071 4.1740 15.3661 7.2799 13.9930 21.8930 166.7315 163.7051 11.2989 608.9691 31.5233 12.8947 3.4921 38.2513 10.5296 45.7620 0.2779 9.3117 3.1403 2.2922 10.5190 18.4333 12.9450 12.9760 83.3175 23.4201 9.1796 13.4399 44.2672 14.6457 6.3933 0.4427 1.5673 23.0010 31.9052 20.3300 2.8447 30.9906 10.0881 15.6507 0.5262 13.6481 27.7759 15.6785 436.9922 48.9596 456.7589 14.5406 23.0148 62.2194 9.5753 495.8554 38.2409 52.0503 32.7010 33.8910 97.3679 49.0726 42.2763 42.7648 34.5196 26.2237 81.9242 89.0843 56.6775 58.7427 17.8930 18.4491 6.5502 154.6932 8.2768 22.5901 19.6019 5.6145 18.0780 58.5698 24.1151 7.9349 26.6633 20.6792 19.1496 2.9137 53.6514 16.0231
temp: 298.150 k
press: 1.00000 atm
elementType: 8 7 7 6 6 6 6 6 6 6 6 6 6 6 6 6 6 6 6 6 6 6 6 6 6 1 1 1 1 1 1 1 1 1 1 1 1 1 1 1 1 1 1 1 1 1 1 1 1 1 1 1 1 1 1 1 1
symmnumber: 1
zpe: 1275437.2 jmol-1
zpe.correction: 0.485788 hartree
zpe.thermalcorrener: 0.514784 hartree
zpe.thermalcorrenthalpy: 0.515729 hartree
zpe.thermalcorrgfe: 0.423804 hartree
zpe.sumelectzpe: -1040.292370 hartree
zpe.sumelectthermal: -1040.263374 hartree
zpe.sumelectthermalent: -1040.262430 hartree
zpe.sumelectthermalfe: -1040.354355 hartree
dipole: -2.8887 -5.4567 -1.4299
dipole: 6.3376
quadrupole: -137.2349 -152.4447 -158.0705
quadrupole: -48.1490 -11.5052 -0.5001
quadrupole: 12.0151 -3.1947 -8.8204 -48.1490 -11.5052 -0.5001
hfenergy: -1040.7781585 hartree
pointgroup: C01 [X(C22H32N2O1)]
dipole: 1.1606129 2.1426737 -0.528208 debye
polarizability: 1028.85038|17.426388|260.7393562|-25.609566|-3.6574452|163.858319 unknown
InChI: InChI=1S/C22H32N2O/c1-17(9-7-10-18(2)14-16-23-24-20(4)25)12-13-21-19(3)11-8-15-22(21,5)6/h7,9-10,12-14,16,24H,8,11,15H2,1-6H3
charge 0 multiplicity 1
57 atoms
O  -9.230555 -2.145906 0.625797
N  -7.005228 -0.454167 0.18939
N  -8.322175 -0.034533 0.127059
C  6.353019 0.428338 0.662551
C  7.460346 -0.56503 1.121604
C  7.845334 -1.575287 0.028587
C  5.19154 -0.321405 -0.056899
C  6.61483 -2.421439 -0.347736
C  5.334148 -1.6122 -0.5352
C  6.968694 1.489869 -0.299366
C  5.825302 1.15067 1.936767
C  3.970639 0.487119 -0.231821
C  4.258303 -2.355728 -1.310929
C  2.655477 0.074685 -0.15474
C  1.48596 0.930675 -0.319475
C  1.694118 2.399667 -0.644237
C  0.2231 0.358361 -0.168836
C  -1.057631 1.005538 -0.28427
C  -2.263303 0.340783 -0.105916
C  -3.586509 0.928712 -0.204905
C  -3.703355 2.408887 -0.532393
C  -4.689096 0.10367 0.007102
C  -6.079076 0.473531 -0.042655
C  -9.388295 -0.929213 0.355399
C  -10.764365 -0.272302 0.241871
H  7.096993 -1.121613 2.010075
H  8.344616 0.017473 1.448691
H  8.666417 -2.230662 0.3770
H  8.219883 -1.043168 -0.867075
H  6.434837 -3.18789 0.439147
H  6.81481 -2.995529 -1.274908
H  7.426903 1.013853 -1.18427
H  6.206715 2.203335 -0.662826
H  7.748885 2.074254 0.225029
H  5.30668 0.440235 2.606305
H  5.116815 1.962537 1.694818
H  6.67169 1.595781 2.494591
H  4.143741 1.563004 -0.381893
H  3.689999 -3.051324 -0.659531
H  3.530335 -1.675007 -1.781845
H  4.719989 -2.976235 -2.10261
H  2.444297 -0.975057 0.089555
H  0.745648 2.947841 -0.749685
H  2.281502 2.898386 0.150729
H  2.259598 2.519551 -1.587829
H  0.192805 -0.716808 0.069552
H  -1.078861 2.075841 -0.525022
H  -2.226753 -0.73265 0.135151
H  -3.240285 2.631595 -1.512352
H  -4.747176 2.757348 -0.570959
H  -3.175455 3.019517 0.224221
H  -4.511353 -0.954682 0.240468
H  -6.354465 1.522615 -0.273083
H  -8.548658 0.949401 -0.089628
H  -11.346282 -0.795316 -0.536444
H  -11.302071 -0.403495 1.196666
H  -10.732521 0.804375 -0.002384
