program: Gaussian 09
title: 000148902
version: EM64L-G09RevD.01
frameworkgroup: C1[X(C6H12ClN3O3)]
method: RPBEPBE
basis: SDD
operation: Freq
keyword: #p
keyword: freq=noraman
keyword: PBEPBE/SDD
title: #p freq=noraman PBEPBE/SDD
converged: YES YES NO NO
title: Mulliken charges:
elementType: Cl O O O N N N C C C C C C H H H H H H H H H H H H
charge: -0.039110 -0.434296 -0.260370 -0.232206 -0.378817 -0.179383 0.038374 -0.387043 -0.388541 -0.304315 -0.334417 0.335871 -0.568388 0.220793 0.259002 0.232829 0.221747 0.344272 0.192134 0.212477 0.276552 0.270444 0.288747 0.279695 0.333953
chargesum: 0.00000
title: Mulliken charges with hydrogens summed into heavy atoms:
elementType: Cl O O O N N N C C C C C C
charge: -0.039110 -0.100343 -0.260370 -0.232206 -0.034546 -0.179383 0.038374 0.092751 0.066035 0.100296 0.212578 0.335871 0.000054
polarizability: 1.40561407e+02 4.32919930e+00 1.02473495e+02 4.36772491e+00 -1.35828614e+01 8.62000666e+01
1716.lowfreq: -8.8229 -5.1229 -4.3994 -0.0024 -0.0016 -0.0014 11.0076 16.9157 38.0499
frequency: 10.7375 16.6835 38.0472 56.3305 64.3646 87.4788 112.6379 148.9796 168.5008 211.9218 236.3689 250.0395 290.0669 318.3547 330.8805 358.9713 420.0182 453.6090 502.1646 530.2234 664.7471 690.9710 705.3139 721.4837 768.4660 791.5314 819.6210 876.2522 904.6085 927.5098 985.0178 1035.2163 1050.6495 1056.0131 1069.1355 1089.6472 1156.4550 1163.5738 1211.9801 1246.2277 1262.8344 1265.7933 1278.3289 1309.9126 1326.0674 1352.9089 1357.5291 1361.8875 1371.2572 1383.9813 1436.3800 1454.3396 1456.4862 1461.8460 1483.6070 1494.0176 1665.1358 2950.7191 2988.7250 3010.9523 3044.9376 3045.4963 3068.7242 3069.6563 3080.9811 3120.7610 3158.3360 3511.2682 3561.8146
redmass: 5.9814 3.7088 9.1839 8.1406 3.4840 1.8826 5.0458 4.3782 5.8545 6.4449 4.5106 7.8731 2.0411 1.3864 2.6643 5.1443 5.6733 10.7184 5.2739 3.1217 1.1247 6.8643 5.0928 3.1161 1.4352 1.4466 3.3384 2.3136 2.5184 2.5277 4.2881 3.0623 1.6143 3.5652 1.6317 2.5476 2.7903 1.3882 1.7790 2.3484 1.3632 1.1993 1.2344 1.1564 1.2271 1.3111 1.3325 1.2450 5.7863 1.2953 1.1097 1.0937 1.1024 1.0849 1.0992 1.8456 9.2477 1.0682 1.0616 1.0622 1.0596 1.0948 1.0566 1.0991 1.1039 1.1045 1.1128 1.0778 1.0662
irintensity: 0.9784 0.2126 0.4528 5.2944 1.4762 5.1622 1.2136 14.0619 7.1038 2.3266 12.3162 3.6444 18.7309 93.5756 45.5152 24.8721 6.8012 0.1623 2.8399 6.7845 115.5366 42.1423 26.9425 7.4260 19.2928 68.6037 24.0975 50.5108 7.8105 91.1635 114.6777 50.7741 13.5246 0.7816 23.5552 14.6442 41.2812 6.7690 6.5673 20.0759 27.9103 6.1631 32.0317 29.1549 32.5318 7.6347 21.7530 3.8432 151.8282 14.9459 22.2500 6.3632 37.5133 6.3726 16.8759 365.2219 210.2321 64.8638 18.2681 28.5259 1.9000 10.0363 14.4494 55.8530 17.4466 1.2661 2.6139 47.8436 8.0902
temp: 298.150 k
press: 1.00000 atm
elementType: 17 8 8 8 7 7 7 6 6 6 6 6 6 1 1 1 1 1 1 1 1 1 1 1 1
symmnumber: 1
zpe: 507668.1 jmol-1
zpe.correction: 0.193361 hartree
zpe.thermalcorrener: 0.208563 hartree
zpe.thermalcorrenthalpy: 0.209508 hartree
zpe.thermalcorrgfe: 0.146339 hartree
zpe.sumelectzpe: -1084.726833 hartree
zpe.sumelectthermal: -1084.711631 hartree
zpe.sumelectthermalent: -1084.710686 hartree
zpe.sumelectthermalfe: -1084.773855 hartree
dipole: 1.9891 0.5516 0.9020
dipole: 2.2527
quadrupole: -102.6399 -88.5767 -88.2690
quadrupole: 2.7112 5.8674 7.9523
quadrupole: -9.4780 4.5851 4.8929 2.7112 5.8674 7.9523
hfenergy: -1084.920194 hartree
pointgroup: C01 [X(C6H12Cl1N3O3)]
dipole: 0.760696 -0.2158971 -0.4002472 debye
dipolederiv: -0.5243484 0.2327958 0.0461057 0.2006322 -0.2879158 -0.0405522 0.0201173 -0.0328098 -0.180283 -0.4358475 -0.2364719 -0.1675588 -0.299309 -0.4171952 -0.0295874 -0.2874218 -0.0188985 -0.7818647 -0.7143563 -0.0179555 0.0761109 0.2045253 -0.8362604 0.2429576 0.0035812 0.222455 -0.4724557 -0.548661 -0.7347724 0.3408411 -0.103109 -0.6176459 0.1742329 0.16916 0.3647647 -0.3455616 -1.3721211 0.0734808 0.02865 0.2795142 -0.4851176 -0.0607719 0.0160319 -0.0550738 -0.4569753 -0.6632111 -0.0631411 0.163995 -0.5266747 -0.9736486 0.4069008 0.5048989 0.2889887 -0.3916895 -0.0041489 0.5285251 -0.1865642 0.3774511 1.1251874 -0.5407279 -0.2478132 -0.6373311 0.2582054 0.6915367 0.0825092 -0.0387612 0.2101156 0.2406264 0.0601057 -0.1896269 0.0709675 0.226129 -0.0246321 -0.0502238 -0.0881137 -0.0215031 0.0028432 0.033752 -0.0724885 -0.0394921 -0.0992986 0.4569562 0.1057022 0.0905679 0.1003234 0.3747754 0.0736916 0.2033382 0.1075647 0.533752 0.18904 -0.0610003 0.0175437 -0.1253001 0.0650904 0.0738619 -0.0523631 0.0635634 0.1523263 2.0668444 0.1472399 -0.377025 -0.2259345 1.0963449 -0.4042764 -0.29932 -0.3909649 0.5423144 0.6388963 -0.2777017 -0.0635716 -0.2785393 0.3362981 0.0125227 -0.0804126 0.0699395 0.1434426 -0.0632827 0.0510908 0.055087 0.0604864 -0.076352 -0.1015925 0.0383832 -0.0394107 0.0854846 0.0201862 0.0190803 -0.0865101 -0.0544361 0.0545157 0.0893891 -0.0119859 0.0362858 -0.0460914 -0.1037079 -0.0796871 0.0829073 -0.0750682 0.0556137 0.057582 0.0429087 0.0479565 0.0151904 0.0369946 0.1118101 0.0315971 0.0941258 -0.0489541 -0.0446428 0.0152043 -0.0697155 0.0071072 0.2784607 0.0103442 0.0084225 0.0438081 0.2317825 0.0461119 0.0192365 0.0743378 0.292222 -0.1558256 -0.1422971 0.0584801 -0.1021347 -0.0187963 0.0287958 0.0836856 0.0373331 -0.0359232 -0.0058858 0.0940622 0.0154387 0.074326 -0.0748888 -0.0541642 0.0219127 -0.0823808 0.0262083 0.1327405 0.0271472 0.0201431 0.0582354 0.0735962 0.0416427 0.0189287 0.0185214 0.0088464 0.0199811 -0.006102 -0.0222485 -0.0726098 0.015646 -0.0385079 0.0431681 -0.0111922 0.0947775 -0.0666042 -0.0457801 -0.0278721 -0.0147182 -0.00374 -0.0312502 -0.0069167 -0.0031626 0.084056 0.0038935 0.0565922 -0.0131963 0.0451948 0.0171403 0.0936924 0.0005782 0.0244996 -0.0256993 0.1471026 0.174753 0.0355312 0.1505986 0.1510545 -0.0891657 0.0472155 -0.0467457 0.3657802 unknown
polarizability: 139.482192|-6.5451456|107.9310261|-6.7398861|-8.8793833|81.8217506 unknown
InChI: InChI=1S/C6H12ClN3O3/c7-2-4-10(9-13)6(12)8-3-1-5-11/h8,11H,1-5H2
charge 0 multiplicity 1
25 atoms
Cl -4.505444 1.814919 0.698281
O  4.437199 0.628619 1.8719
O  -0.164952 1.272462 -1.354159
O  -2.140596 -2.335469 0.722492
N  1.061826 -0.653091 -0.80979
N  -1.264638 -0.541456 -0.334645
N  -1.086373 -1.80995 0.230656
C  2.351869 -0.141166 -1.311383
C  3.146391 0.678745 -0.267241
C  3.600621 -0.150698 0.94797
C  -2.578843 0.137411 -0.40007
C  -0.073468 0.107864 -0.877973
C  -2.809786 1.008664 0.845512
H  2.94718 -1.008934 -1.651513
H  2.143454 0.494759 -2.188852
H  4.042607 1.101621 -0.760212
H  2.523282 1.53413 0.061966
H  0.982931 -1.584561 -0.391522
H  2.722343 -0.579632 1.477734
H  4.253703 -0.981775 0.62861
H  -2.588327 0.763154 -1.305357
H  -3.353003 -0.645939 -0.465205
H  -2.086469 1.833837 0.908515
H  -2.835597 0.418791 1.772856
H  3.915287 1.401397 2.206329
