program: Gaussian 09
title: 000148897
version: EM64L-G09RevD.01
frameworkgroup: C1[X(C15H12O5)]
method: RPBEPBE
basis: SDD
operation: Freq
keyword: #pfreq=noraman
keyword: PBEPBE/SDD
title: #p freq=noraman PBEPBE/SDD
converged: NO YES NO YES
title: Mulliken charges:
elementType: O O O O O C C C C C C C C C C C C C C C H H H H H H H H H H H H
charge: -0.224129 -0.238959 -0.278076 -0.195059 -0.216450 0.293388 0.242604 -0.033628 0.334670 0.053713 -0.621047 0.369614 -0.442574 -0.774550 0.223994 -0.477871 -0.806886 0.123316 0.135109 -0.495000 0.267289 0.293087 0.252685 0.251348 0.251362 0.256238 0.243233 0.243230 0.243669 0.234642 0.245514 0.245524
chargesum: 0.00000
title: Mulliken charges with hydrogens summed into heavy atoms:
elementType: O O O O O C C C C C C C C C C C C C C C
charge: -0.224129 -0.238959 -0.278076 -0.195059 -0.216450 0.293388 0.242604 -0.033628 0.334670 0.053713 -0.353758 0.369614 -0.149487 -0.019155 0.223994 -0.221633 -0.076754 0.123316 0.135109 0.230680
polarizability: 3.59842675e+02 -4.12310628e+00 1.87454285e+02 2.83878997e-02 -1.54107075e-02 8.30170389e+01
1716.lowfreq: -12.3829 -3.2562 -0.6092 -0.0004 -0.0002 0.0006 38.7792 50.9277 69.9342
frequency: 38.7711 50.9218 69.9232 76.2031 80.8669 94.2814 119.2268 151.6734 170.5247 177.9729 191.7061 210.8372 212.4680 224.1017 247.3253 291.9321 325.5781 327.1608 369.4711 379.6586 433.1236 466.3729 484.0362 488.8587 537.1541 566.7122 572.6754 579.3221 587.0105 660.7766 687.6159 709.5570 717.7180 731.9363 765.5085 765.7576 776.7861 853.8759 874.7379 875.3635 882.0018 900.6689 921.5779 959.6433 1012.3238 1041.9819 1046.7434 1054.5623 1071.8919 1079.9891 1112.6689 1126.8521 1145.9534 1166.9055 1178.6856 1215.9462 1231.0125 1274.1935 1298.3463 1368.7555 1392.6724 1402.1934 1409.1443 1422.3151 1428.0845 1452.6303 1462.4672 1464.2162 1464.5160 1467.4721 1471.6072 1474.9343 1547.7816 1589.7024 1611.6754 1631.8827 1651.5544 1686.3520 2982.8445 2998.7404 3006.0196 3059.9413 3076.5040 3104.7744 3108.3736 3118.5936 3151.7837 3168.6493 3171.5594 3241.0711
redmass: 6.1337 5.0028 1.6383 1.6835 4.9841 1.2950 3.2421 4.3103 2.8954 2.6938 5.0288 1.4426 3.8657 5.7990 4.8133 4.1411 5.7391 4.3153 6.1446 6.9179 8.5845 7.5595 6.5262 3.7127 6.4100 4.9251 5.4737 4.7586 4.5182 4.7093 5.1901 5.1498 9.1619 5.8256 7.5408 4.3836 6.7940 1.3768 4.0242 1.4072 9.0638 1.5789 7.2574 3.0451 1.6580 1.4887 1.5799 3.5317 2.6690 5.8314 1.2607 4.3052 1.4964 2.0651 2.2755 5.2322 1.6781 6.5707 2.4593 3.4121 1.8492 1.4141 1.9872 1.2052 3.4644 1.0494 1.3601 2.3049 1.0440 1.0456 1.1050 1.3374 7.2659 8.9556 7.5728 7.8888 10.6849 10.4489 1.0382 1.0372 1.0296 1.0969 1.0971 1.0985 1.1047 1.1005 1.1047 1.0922 1.0922 1.0987
irintensity: 0.0134 0.5217 3.1614 1.1653 0.3450 0.5973 0.1750 5.0553 0.2148 1.6941 2.1935 1.3815 4.9671 7.0434 0.2459 19.9447 0.0031 0.6882 3.7717 0.3312 0.3595 7.5197 7.1023 4.1278 2.8121 0.3251 3.5017 2.0802 6.1902 2.1564 52.0293 6.8761 6.9319 6.4616 21.3007 7.3955 11.8834 5.5792 64.6683 4.8357 2.1898 63.0463 10.0204 3.2460 31.0913 1.0679 8.7660 189.6994 0.3311 266.5802 0.0451 23.9372 160.1214 233.2421 46.2373 28.3546 15.4420 110.7518 15.5565 38.0783 3.4160 55.1759 13.9285 13.9537 34.8544 14.6661 48.7817 29.0065 15.2734 17.2921 22.8560 4.2281 103.2298 87.6256 46.1091 87.7424 381.2313 576.2850 11.0598 8.8670 45.8887 11.7332 8.8603 22.0423 24.8897 4.6558 14.7845 2.0635 2.7380 1.7179
temp: 298.150 k
press: 1.00000 atm
elementType: 8 8 8 8 8 6 6 6 6 6 6 6 6 6 6 6 6 6 6 6 1 1 1 1 1 1 1 1 1 1 1 1
symmnumber: 1
zpe: 617609.6 jmol-1
zpe.correction: 0.235235 hartree
zpe.thermalcorrener: 0.253489 hartree
zpe.thermalcorrenthalpy: 0.254434 hartree
zpe.thermalcorrgfe: 0.188405 hartree
zpe.sumelectzpe: -953.507539 hartree
zpe.sumelectthermal: -953.489285 hartree
zpe.sumelectthermalent: -953.488341 hartree
zpe.sumelectthermalfe: -953.554369 hartree
dipole: -2.8676 6.7693 -0.0020
dipole: 7.3516
quadrupole: -121.9265 -110.3415 -115.3330
quadrupole: 6.7648 -0.0124 0.0037
quadrupole: -6.0595 5.5255 0.5340 6.7648 -0.0124 0.0037
hfenergy: -953.7427743 hartree
pointgroup: C01 [X(C15H12O5)]
dipole: 1.1184701 -2.6673339 -0.0007771 debye
polarizability: 359.8102719|-4.7523541|187.4866876|-0.0283314|0.0155142|83.0170389 unknown
InChI: InChI=1S/C15H12O5/c1-7-4-12(16)20-14-8(2)13-9(5-10(7)14)6-11(19-13)15(17)18-3/h4-6H,1-3H3
charge 0 multiplicity 1
32 atoms
O  1.899793 1.104929 -0.000276
O  -2.94787 1.33147 0.000406
O  4.925993 -0.945331 -0.00027
O  -5.249667 1.45293 0.001365
O  4.742411 1.392824 -0.000089
C  -1.792201 -0.858467 -0.000065
C  -0.573137 1.352076 0.00014
C  0.596966 0.579781 -0.000177
C  0.642299 -0.853369 -0.000429
C  -1.765107 0.583095 0.000182
C  -0.568318 -1.574708 -0.000347
C  -3.098646 -1.521675 0.00011
C  2.044918 -1.209682 -0.00072
C  -0.5785 2.861631 0.000379
C  2.765685 -0.026452 -0.000604
C  -4.249468 -0.759361 0.000333
C  -3.179627 -3.03231 0.00011
C  -4.259092 0.698783 0.000148
C  4.207486 0.260846 -0.000764
C  6.4011 -0.792468 0.000407
H  -0.568233 -2.667729 -0.000514
H  2.484211 -2.204296 -0.000972
H  0.449125 3.256263 0.000766
H  -1.112874 3.251344 -0.884052
H  -1.11348 3.251066 0.884561
H  -5.237844 -1.226751 0.000637
H  -2.680467 -3.458854 0.890292
H  -2.680704 -3.458861 -0.890204
H  -4.22729 -3.372619 0.000256
H  6.78798 -1.820777 0.000775
H  6.728247 -0.243777 -0.898606
H  6.727408 -0.243451 0.899524
