program: Gaussian 09
title: 000148946
version: EM64L-G09RevD.01
frameworkgroup: C1[X(C20H16ClN3O2S)]
method: RPBEPBE
basis: SDD
operation: Freq
keyword: #p
keyword: freq=noraman
keyword: PBEPBE/SDD
title: #p freq=noraman PBEPBE/SDD
converged: YES YES NO NO
title: Mulliken charges:
elementType: Cl S O O N N N C C C C C C C C C C C C C C C C C C C C H H H H H H H H H H H H H H H H
charge: -0.010715 0.984799 -0.539753 -0.534288 -0.504281 0.006570 -0.505369 0.229270 0.269528 0.239185 -0.003348 -0.098696 0.447832 -0.406732 -0.334073 -0.229344 -0.305936 -0.446246 -0.318697 0.285547 -0.250988 -0.260437 -0.257979 -0.235689 -0.286830 -0.369563 -0.761529 0.311803 0.231004 0.269617 0.273143 0.237060 0.272698 0.236577 0.235763 0.288949 0.230221 0.260517 0.237510 0.274460 0.263551 0.297560 0.277330
chargesum: 0.00000
title: Mulliken charges with hydrogens summed into heavy atoms:
elementType: Cl S O O N N N C C C C C C C C C C C C C C C C C C C C
charge: -0.010715 0.984799 -0.539753 -0.534288 -0.192478 0.006570 -0.230909 0.229270 0.269528 0.239185 -0.003348 -0.098696 0.447832 -0.175728 -0.064455 -0.229344 -0.032792 -0.209186 -0.045999 0.285547 -0.014411 -0.024674 0.002538 0.001821 0.002119 -0.139342 0.076911
polarizability: 5.86147842e+02 2.80308835e-01 3.42686136e+02 6.22504526e+00 -1.79787623e+01 1.87365144e+02
1716.lowfreq: -4.7504 -0.0003 0.0011 0.0014 2.1814 4.2547 15.5741 19.7985 30.6146
frequency: 15.5471 19.7576 30.6052 36.2008 48.5302 66.9511 77.9653 93.8095 111.2404 130.8607 146.9656 152.2269 162.3924 181.7596 184.9285 194.9985 231.9294 249.9397 256.4524 288.9231 306.2281 318.8726 330.8165 365.0311 367.6342 393.7506 401.1308 417.6924 422.8602 429.3139 467.9804 493.8641 497.3288 508.5873 523.6570 536.9709 550.7427 562.6763 579.7498 598.9071 623.9935 635.3385 650.4772 689.3764 723.4249 733.7613 746.5841 771.2392 771.7202 784.0102 805.1331 813.8235 818.0297 826.7613 831.0809 844.9124 860.3453 877.3719 882.0368 893.7232 898.7119 943.1085 948.8671 950.1920 962.0624 969.4699 971.6748 995.4782 998.0943 1007.7022 1021.0121 1067.6944 1086.6003 1115.9741 1123.9028 1157.4215 1181.6752 1183.6302 1196.4108 1200.7447 1242.2105 1249.7934 1259.8692 1276.2390 1283.0614 1288.4784 1318.3275 1345.7840 1351.6086 1372.8793 1390.4140 1408.7592 1417.0010 1421.0694 1427.5846 1436.0532 1452.3669 1469.4652 1483.3911 1497.3226 1519.9783 1544.2033 1550.2888 1573.2229 1603.1698 1612.8578 1626.4482 3029.3161 3119.7635 3125.5159 3135.0352 3136.7548 3151.5679 3157.2297 3166.6517 3169.4001 3176.0692 3176.8869 3179.2810 3179.7238 3183.7199 3354.2109 3519.3602
redmass: 8.0942 6.0115 6.9679 5.5466 6.1091 5.8078 4.4523 5.2123 5.4334 5.7764 7.3020 6.6801 1.1684 5.1103 6.5930 4.6656 5.1705 4.8194 5.3786 4.8805 5.1053 6.9187 6.6149 7.2032 7.6410 4.1505 3.9372 3.6072 4.5298 3.8323 6.5931 2.0871 2.9912 3.2474 2.9687 4.5744 4.4987 5.6367 3.7496 7.1176 6.4568 6.0233 6.1656 6.7286 4.0594 4.4493 2.7720 1.8464 1.6396 3.6169 2.6572 1.7784 3.3003 2.4364 2.7519 1.5907 4.6330 1.7202 6.2757 2.1776 1.4055 4.1040 1.4385 1.4190 1.3659 1.3424 1.3518 2.7467 1.3303 2.3427 2.1744 2.0565 3.8968 1.5753 2.1065 1.2836 1.1909 1.1819 1.4179 1.1981 2.5127 2.8482 2.0909 1.8835 1.1394 4.0299 1.6785 2.2084 2.9494 3.5112 3.0425 1.0594 1.0580 3.6384 4.4229 3.6015 3.1585 2.5015 2.5169 3.0604 7.2061 7.7026 6.2245 3.6844 6.0476 6.1902 6.3979 1.0239 1.0897 1.0905 1.0862 1.0862 1.0897 1.0933 1.0944 1.0949 1.0974 1.0997 1.0956 1.1071 1.1080 1.0754 1.0749
irintensity: 3.5675 4.7296 1.5473 2.0547 0.1016 0.2663 2.8355 10.0423 3.8415 19.5076 4.1454 52.3981 4.9625 0.9301 35.9195 6.4792 0.9270 4.1519 2.2037 8.0316 4.9930 9.2597 34.3273 4.5184 9.2647 26.5304 12.2547 6.0562 13.7765 6.2916 1.2166 198.2379 34.9849 79.9767 10.4229 6.6343 35.5586 20.3082 3.4645 6.6359 8.3379 4.4823 10.7630 19.4505 17.6357 38.3307 51.9599 91.7054 10.6507 6.6719 47.6008 60.4394 9.3118 68.8026 58.8885 59.2071 10.7762 0.9591 10.1785 16.6178 3.2299 43.0320 78.6787 74.5917 1.0165 0.5430 2.0836 0.0482 0.3166 45.8004 5.7991 6.5082 0.3908 33.5185 25.1253 1.6544 23.7802 14.5913 3.0966 1.6829 1.7348 16.5623 10.1721 15.7437 8.6298 14.5654 13.7061 0.5851 165.9498 125.0832 4.9251 6.3962 10.7869 33.9053 267.7791 6.8862 3.4392 12.4497 170.5062 405.5528 28.6713 23.1916 29.2167 42.4641 19.0335 318.4585 11.0879 0.7627 13.1517 11.0888 1.0781 5.2668 9.3372 16.9056 12.0626 6.2688 11.5040 21.1920 0.7973 0.1131 1.0922 11.7250 30.1789
temp: 298.150 k
press: 1.00000 atm
elementType: 17 16 8 8 7 7 7 6 6 6 6 6 6 6 6 6 6 6 6 6 6 6 6 6 6 6 6 1 1 1 1 1 1 1 1 1 1 1 1 1 1 1 1
symmnumber: 1
zpe: 823639.0 jmol-1
zpe.correction: 0.313708 hartree
zpe.thermalcorrener: 0.338216 hartree
zpe.thermalcorrenthalpy: 0.339160 hartree
zpe.thermalcorrgfe: 0.256796 hartree
zpe.sumelectzpe: -1942.508698 hartree
zpe.sumelectthermal: -1942.484189 hartree
zpe.sumelectthermalent: -1942.483245 hartree
zpe.sumelectthermalfe: -1942.565609 hartree
dipole: -3.2595 -1.1499 -1.0651
dipole: 3.6168
quadrupole: -254.7895 -148.7978 -164.3307
quadrupole: 0.7544 -18.3053 -2.2322
quadrupole: -65.4835 40.5082 24.9753 0.7544 -18.3053 -2.2322
hfenergy: -1942.8224057 hartree
pointgroup: C01 [X(C20H16Cl1N3O2S1)]
dipole: 1.1992216 -0.6981211 0.3151712 debye
polarizability: 580.6097321|-37.3271903|338.6150875|4.4341508|41.4742879|196.9743027 unknown
InChI: InChI=1S/C20H16ClN3O2S/c1-27(25,26)24-14-11-9-13(10-12-14)22-19-15-5-2-3-8-18(15)23-20-16(19)6-4-7-17(20)21/h2-12,22,24H,1H3
charge 0 multiplicity 1
43 atoms
Cl 6.015973 -2.410094 0.712551
S  -6.345917 0.161151 0.559056
O  -7.622853 0.822972 1.3167
O  -6.451246 -0.443292 -0.945679
N  0.176548 -0.172576 -1.275847
N  4.060984 -0.119217 0.571015
N  -4.92418 1.606493 0.474586
C  1.437265 -0.131153 -0.629095
C  2.216037 -1.334738 -0.574467
C  1.981584 1.084412 -0.103279
C  3.552039 -1.256042 0.018022
C  3.298498 1.018548 0.523994
C  -1.069477 0.278903 -0.791529
C  1.728867 -2.599364 -1.054108
C  1.336289 2.365772 -0.210337
C  4.343804 -2.46601 0.021791
C  3.863621 2.214379 1.091508
C  -2.173485 0.332644 -1.694274
C  -1.273218 0.641947 0.571376
C  -3.643723 1.135034 0.100368
C  2.535261 -3.733654 -1.012791
C  1.925003 3.506044 0.330043
C  3.865259 -3.668192 -0.482826
C  3.191442 3.428902 1.004976
C  -3.436184 0.759142 -1.261595
C  -2.546204 1.040626 1.0087
C  -5.676937 -1.275643 1.666567
H  0.137712 -0.720697 -2.138318
H  0.701598 -2.684954 -1.423805
H  0.378177 2.445772 -0.73043
H  4.843084 2.120557 1.569672
H  -2.026098 0.059917 -2.746458
H  -0.444369 0.588116 1.282614
H  2.155529 -4.695023 -1.373395
H  1.423533 4.474964 0.233005
H  -4.277961 0.823684 -1.95677
H  -2.694184 1.300471 2.065018
H  4.494988 -4.562098 -0.460262
H  3.632083 4.33564 1.433087
H  -4.963782 2.001191 1.435469
H  -5.634831 -0.887576 2.693407
H  -6.411905 -2.084916 1.554958
H  -4.691324 -1.549342 1.265781
